Peptide,PTM,ModifiedAA,ModifiedPosition,PeptideUniqueToGene,ExperimentDesc,ExpID,PubmedID,ScoreType,IdentScore,LocProb,Log2FChange,PQ-val,QuantSig,PEP,MassErrorPPM
ASTFTSSSSVLTPTTFLGQTKASSFNPLR,nta,A,2,true,"HUNTER N-terminome: legumain, GluC and trypsin",119,31951383,"MaxQuant score",106.5100000,,,,,,
ASSFNPLRDVVSLGSPK,ph,S,25,true,"TOR Kinase and ABA Receptor",100,29290610,XCorr,3.5011852,0.9242000,,,,0.00013949999993201,
ASSFNPLR,ph,S,25,true,"atm and atr DNA damage response",88,25561503,"MASCOT Score",41.0000000,0.9970000,,,,,-0.0500000
ASSFNPLR,ph,S,25,true,"Tissue atlas Arabidopsis - ProteomicsDB",114,32188942,"MaxQuant score",109.4400000,0.9999130,,,,0.0037609001155943,
DVVSLGSPK,ph,S,34,true,"Tissue atlas Arabidopsis - ProteomicsDB",114,32188942,"MaxQuant score",94.3630000,0.9980790,,,,0.0017096200026572,
DVVSLGSPK,ph,S,37,true,"Tissue atlas Arabidopsis - ProteomicsDB",114,32188942,"MaxQuant score",93.3450000,0.9995950,,,,0.0018675599712878,
GNDLWYGPDR,nt,G,43,true,"FtsH12 N-terminome: WT / FtsH12 knockdown miRNA",118,33216923,"MaxQuant score",125.2200000,,,,,1.9099999359895E-9,
GNDLWYGPDR,nt,G,43,true,"HUNTER N-terminome: legumain, GluC and trypsin",119,31951383,"MaxQuant score",159.9300000,,,,,,
GNDLWYGPD,nt,G,43,true,"HUNTER N-terminome: legumain, GluC and trypsin",119,31951383,"MaxQuant score",89.6980000,,,,,,
GNDLWYGPDR,nta,G,43,true,"HUNTER N-terminome: legumain, GluC and trypsin",119,31951383,"MaxQuant score",99.6880000,,,,,,
DLWYGPDR,nt,D,45,true,"HUNTER N-terminome: legumain, GluC and trypsin",119,31951383,"MaxQuant score",83.2650000,,,,,,
TGEFPGDYGWDTAGLSADPE,nt,T,68,false,"HUNTER N-terminome: legumain, GluC and trypsin",119,31951383,"MaxQuant score",92.7810000,,,,,,
WAMLGAFGCITPEVLQK,sno,C,110,true,"S-Nitroso-Proteome guard cells - 15 min flg22",116a,32121556,,,,0.5655972,0.0320000,YES,,
WAMLGAFGCITPEVLQK,sno,C,110,true,"S-Nitroso-Proteome guard cells - 30 min flg22",116b,32121556,,,,-0.8109662,0.0470000,YES,,
VDFKEPVWFK,ac,K,125,true,"Histone deacetylases substrates - TSA vs control",98b,29061669,"MaxQuant Score",77.1000000,1.0000000,0.4320000,0.9794900,NO,0.0005900000105612,
VDFKEPVWFK,ac,K,125,true,"Histone deacetylases- hda14 vs WT (low light)",98c,29061669,"MaxQuant Score",91.9600000,1.0000000,1.2330000,0.9885531,NO,0.0080000003799796,
VDFKEPVWFK,ac,K,125,true,"Histone deacetylases - hda14 vs WT (thylakoids)",98d,29061669,"MaxQuant Score",107.1000000,1.0000000,0.1160000,0.9506048,NO,0.0040000001899898,
VDFKEPVWFK,ac,K,125,true,"Quantitative Acetylproteomics",101,29440448,,,,,,,,
VDFKEPVWFK,ac,K,131,true,"Quantitative Acetylproteomics",101,29440448,,,,,,,,
VKEIKNGR,ac,K,212,false,"Quantitative Acetylproteomics",101,29440448,,,,,,,,
VKEIKNGR,ac,K,215,false,"Quantitative Acetylproteomics",101,29440448,,,,,,,,
