Peptide,PTM,ModifiedAA,ModifiedPosition,PeptideUniqueToGene,ExperimentDesc,ExpID,PubmedID,ScoreType,IdentScore,LocProb,Log2FChange,PQ-val,QuantSig,PEP,MassErrorPPM
GSTAETQLTPVQVTDDEAALF,nt,G,2,true,"Arg/N-end rule seed, prt6 vs. Wt",99,29168982,"MASCOT Score",35.5400000,,,,,0.080310001969337,0.0167998
GSTAETQLTPVQVTDDEAALF,nta,G,2,true,"Arg/N-end rule seed, prt6 vs. Wt",99,29168982,"MASCOT Score",35.5400000,,,,,0.080310001969337,0.0167998
GSTAETQLTPVQVTDD,nta,G,2,true,"HUNTER N-terminome: legumain, GluC and trypsin",119,31951383,"MaxQuant score",113.7700000,,,,,,
GSTAETQLTPVQVTD,nta,G,2,true,"HUNTER N-terminome: legumain, GluC and trypsin",119,31951383,"MaxQuant score",179.5900000,,,,,,
NGSPMSPTEIASK,ng,N,51,true,"Conserved N-glycosylation",74,22633491,"MaxQuant Score",67.7990000,1.0000000,,,,0.0070000002160668,0.4000000
NGSPMSPTEIASK,ph,S,56,true,"Tissue atlas Arabidopsis - ProteomicsDB",114,32188942,"MaxQuant score",48.1880000,0.7585400,,,,0.013439799658954,
LPTKNPEAPVMLDR,ub,K,67,true,"upl3 mutant / wildtype",168,35926874,"MaxQuant score",89.9110000,1.0000000,-0.5437195,0.5796000,NO,4.4136500946479E-5,1.0401000
KLSGDGVER,ph,S,96,true,"STN8 phosphoproteome",38,21768351,"MASCOT Score",50.5700000,,,,,,0.2617590
KLSGDGVER,ph,S,96,true,"Pollen phosphoproteome Arabidopsis",43,22631563,"MASCOT Score",43.2000000,,,,,,
KLSGDGVER,ph,S,96,true,"Chloroplast kinase substrates",60,19376835,"MASCOT Score",39.5500000,,,,,,0.8378590
KLSGDGVER,ph,S,96,true,"SnRK2 protein kinase substrates",85,23776212,XCorr,2.5254884,1.0000000,,,,0.084398798644543,
KLSGDGVER,ph,S,96,true,"atm and atr DNA damage response",88,25561503,"MASCOT Score",42.0000000,1.0000000,,,,,-1.7400000
KLSGDGVER,ph,S,96,true,"TOR Kinase and ABA Receptor",100,29290610,XCorr,2.6454034,1.0000000,,,,0.0024019998963922,
KLSGDGVER,ph,S,96,true,"Tissue atlas Arabidopsis - ProteomicsDB",114,32188942,"MaxQuant score",147.0200000,1.0000000,,,,0.00010011599806603,
IYGLGPVCK,sno,C,110,true,"Site-specific nitrosomeproteomic id - gsnor1-3",90a,25699590,XCorr,2.3538873,,,,,0.046799998730421,-6.7207564
IYGLGPVCK,sno,C,110,true,"hot5-4 / wildtype, FAT-switch S-nitrosoproteome",169,37277371,,,,,,,,
NEDGVSIAALCLMNQDK,sno,C,126,true,"hot5-4 / wildtype, FAT-switch S-nitrosoproteome",169,37277371,,,,0.0397201,0.7247176,NO,,
FNKVFNNGMSNHSTITMK,ub,K,172,true,"upl3 mutant / wildtype",168,35926874,"MaxQuant score",104.2600000,1.0000000,-0.3640135,0.6580400,NO,2.1999700672293E-10,-0.7234400
KILETYK,ac,K,188,true,"Quantitative Acetylproteomics",101,29440448,,,,,,,,
YPNLKGINFDLPHVIEDAPSHPGIEHVGGDMFVSVPK,ub,K,224,true,"upl3 mutant / wildtype",168,35926874,"MaxQuant score",81.9170000,1.0000000,-0.5627723,,,1.2541500159897E-14,-0.9271500
NCYESLPEDGK,sno,C,281,true,"Site-specific nitrosomeproteomic id - gsnor1-3",90a,25699590,XCorr,2.2700000,,,,,0.0027369998861104,-6.6400000
NCYESLPEDGK,sno,C,281,true,"Site-specific nitrosomeproteomic id - gsnor1-3",90b,25699590,XCorr,2.8500000,,,,,0.070029996335506,-6.2100000
VILAECILPETPDSSLSTK,ox,C,296,true,"SPEAR - 10 mM H2O2 / mock",138a,34619326,,,,2.0932028,0.0281707,YES,,
VILAECILPETPDSSLSTK,ox,C,296,true,"SPEAR - 50 mM H2O2 / mock",138b,34619326,,,,2.2121101,0.0039549,YES,,
VILAECILPETPDSSLSTK,sno,C,296,true,"Site-specific nitrosomeproteomic id - gsnor1-3",90a,25699590,XCorr,2.2729547,,,,,0.042360000312328,-5.5819587
VILAECILPETPDSSLSTK,sno,C,296,true,"Site-specific nitrosomeproteomic id - gsnor1-3",90b,25699590,XCorr,3.4600000,,,,,0.026979999616742,-6.0000000
VILAECILPETPDSSLSTK,sno,C,296,true,"hot5-4 / wildtype, FAT-switch S-nitrosoproteome",169,37277371,,,,,,,,
VILAECILPETPDSSLSTK,ph,T,301,true,"Tissue atlas Arabidopsis - ProteomicsDB",114,32188942,"MaxQuant score",176.1100000,0.7702280,,,,1.8736000203858E-28,
QVVHVDCIMLAHNPGGK,sno,C,316,true,"Site-specific nitrosomeproteomic id - gsnor1-3",90b,25699590,XCorr,2.1100000,,,,,0.0013640000252053,-7.1500000
