Peptide,PTM,ModifiedAA,ModifiedPosition,PeptideUniqueToGene,ExperimentDesc,ExpID,PubmedID,ScoreType,IdentScore,LocProb,Log2FChange,PQ-val,QuantSig,PEP,MassErrorPPM
ANQRLPPLSTEPDRCE,nt,A,78,true,"N-terminal ChaFRADIC",92,26010716,"MASCOT Score",33.1000000,,,,,5.204999979469E-6,
ANQRLPPLSTEPDR,nt,A,78,true,"N-terminal ChaFRADIC",92,26010716,"MASCOT Score",23.5800000,,,,,1.544000042486E-5,
ANQRLPPLSTEPDR,nt,A,78,true,"Stromal N-terminome",96,26371235,"MASCOT Score",44.1100000,,,,,,
ANQRLPPLSTEPD,nt,A,78,true,"HUNTER N-terminome: legumain, GluC and trypsin",119,31951383,"MaxQuant score",97.4560000,,,,,,
LPPLSTEPDRCEK,ox,C,92,true,"SPEAR - 10 mM H2O2 / mock",138a,34619326,,,,0.5755963,0.0086849,YES,,
FCDYTNDQTNLK,sno,C,117,true,"hot5-4 / wildtype, FAT-switch S-nitrosoproteome",169,37277371,,,,-0.7151006,0.0169846,YES,,
FDGADMTEVVMSK,mox,M,146,true,"cat2 Methionine oxidation - 1h stress",62a,25693801,"MASCOT Score",74.0000000,,0.2172845,,NO,,
FDGADMTEVVMSK,mox,M,146,true,"cat2 Methionine oxidation - 3h stress",62b,25693801,"MASCOT Score",57.0000000,,0.0667059,,NO,,
FDGADMTEVVMSK,mox,M,151,true,"cat2 Methionine oxidation - 1h stress",62a,25693801,"MASCOT Score",74.0000000,,0.2172845,,NO,,
FDGADMTEVVMSK,mox,M,151,true,"cat2 Methionine oxidation - 3h stress",62b,25693801,"MASCOT Score",57.0000000,,0.0667059,,NO,,
VNFGKSNLK,ac,K,178,true,"Quantitative Acetylproteomics",101,29440448,,,,,,,,
LVLGCR,sno,C,235,true,"hot5-4 / wildtype, FAT-switch S-nitrosoproteome",169,37277371,,,,,,,,
