Peptide,PTM,ModifiedAA,ModifiedPosition,PeptideUniqueToGene,ExperimentDesc,ExpID,PubmedID,ScoreType,IdentScore,LocProb,Log2FChange,PQ-val,QuantSig,PEP,MassErrorPPM
AIISEVEEESSSSRPMIFPFR,nt,A,2,true,"Arg/N-end rule pathway Roots",80,25728785,"MASCOT Score",43.9800000,,,,,4.1170000031343E-7,
AIISEVEEESSSSRPMIFPFR,nt,A,2,true,"Stromal N-terminome",96,26371235,"MASCOT Score",46.6500000,,,,,,
AIISEVEEESSSSRPMIFPFR,nt,A,2,true,"Arabidopsis translation initiation landscape - NT",167b,35069635,,,,,,,,
AIISEVEEESSSSRPM,nt,A,2,true,"Arg/N-end rule pathway Roots",80,25728785,"MASCOT Score",124.7700000,,,,,2.7210000919098E-10,
AIISEVEEESSSSRPM,nt,A,2,true,"Arg/N-end rule seed, prt6 vs. Wt",99,29168982,"MASCOT Score",69.6000000,,-0.9550980,0.2525710,NO,0.0012199999764562,-1.2081105
AIISEVEEESSSSR,nt,A,2,true,"Arg/N-end rule seed, prt6 vs. Wt",99,29168982,"MASCOT Score",84.0300000,,-0.2667778,0.1616664,NO,0.0017109999898821,-0.9784210
AIISEVEEESSSSR,nt,A,2,true,"HUNTER N-terminome: legumain, GluC and trypsin",119,31951383,"MaxQuant score",163.7800000,,,,,,
AIISEVEEES,nt,A,2,true,"N-term acetylation drought responses",5,26184543,,,,,,,,
AIISEVEEESSSSRPMIFPFR,nta,A,2,true,"Arabidopsis translation initiation landscape - NTA",167a,35069635,,,,,,,,
AIISEVEEESSSSR,nta,A,2,true,"Characterization plant N-terminal acetylation",6,22223895,"MASCOT Score",61.6200000,,,,,,
AIISEVEEESSSSR,nta,A,2,true,"Arg/N-end rule seed, prt6 vs. Wt",99,29168982,"MASCOT Score",84.0300000,,,,,0.0017109999898821,-0.9784210
AIISEVEEESSSSR,nta,A,2,true,"FtsH12 N-terminome: WT / FtsH12 knockdown miRNA",118,33216923,"MaxQuant score",54.7000000,,,,,0.0055697001516819,
AIISEVEEES,nta,A,2,true,"N-term acetylation drought responses",5,26184543,,,,,,,,
TVVCEIK,sno,C,173,true,"hot5-4 / wildtype, FAT-switch S-nitrosoproteome",169,37277371,,,,,,,,
TVVCEIKKNR,ub,K,176,true,"Arabidopsis ubiquitination COFRADIC",40,26744219,"MaxQuant Score",64.8200000,0.8740000,,,,0.00054749997798353,-0.7660000
SVKPDDCYWNIEDQK,ph,S,198,true,"Tissue atlas Arabidopsis - ProteomicsDB",114,32188942,"MaxQuant score",132.6100000,1.0000000,,,,3.225919954275E-6,
SVKPDDCYWNIEDQK,sno,C,204,true,"Site-specific nitrosomeproteomic id - gsnor1-3",90a,25699590,XCorr,3.5416191,,,,,2.0010000298498E-5,-4.4121981
SVKPDDCYWNIEDQK,sno,C,204,true,"Site-specific nitrosomeproteomic id - gsnor1-3",90b,25699590,XCorr,3.6000000,,,,,0.036010000854731,-5.7900000
SVKPDDCYWNIEDQK,so,C,204,true,"S-sulfenylation site detection using YAP1C",110,32714340,,,,,,,,
VEPETSKLGDLDPETR,ph,T,246,false,"Tissue atlas Arabidopsis - ProteomicsDB",114,32188942,"MaxQuant score",145.0100000,0.9658250,,,,1.4713633875411E-43,
VEPETSKLGDLDPETR,ub,K,248,false,"Protein ubiquitination during photomorphogenesis",3,28461270,,,,,,,,
STVEKMMFDQR,ub,K,262,true,"Arabidopsis ubiquitination COFRADIC",40,26744219,"MaxQuant Score",130.1000000,1.0000000,,,,0,0.0460000
KFMSEHPEMDFSNAK,me2,K,288,true,"Arabidopsis protein methylome",123,31809900,"MaxQuant Score",219.5200000,1.0000000,,,,0,-3.3909000
