Peptide,PTM,ModifiedAA,ModifiedPosition,PeptideUniqueToGene,ExperimentDesc,ExpID,PubmedID,ScoreType,IdentScore,LocProb,Log2FChange,PQ-val,QuantSig,PEP,MassErrorPPM
SVHDRILESEAQF,nt,S,141,true,"Arabidopsis translation initiation landscape - NT",167b,35069635,,,,,,,,
SHSPERSFAAAGDDYMPQLR,ph,S,266,true,"TOR Kinase and ABA Receptor",100,29290610,XCorr,3.8148775,0.8850000,,,,0.000538999971468,
RQSSDRFPR,ph,S,286,true,"Tissue atlas Arabidopsis - ProteomicsDB",114,32188942,"MaxQuant score",96.6400000,0.8137530,,,,0.00049082201439887,
QSSDRFPR,ph,S,287,true,"atm and atr DNA damage response",88,25561503,"MASCOT Score",48.0000000,1.0000000,,,,,-0.2000000
QSSDRFPR,ph,S,287,true,"Tissue atlas Arabidopsis - ProteomicsDB",114,32188942,"MaxQuant score",96.6400000,0.9797360,,,,0.00049082201439887,
ELSQKETPPASTSTTGPLEGVAGVMEVASSNNTIQSR,ph,S,489,true,"TOR Kinase and ABA Receptor",100,29290610,XCorr,5.6563921,0.8492000,,,,1.5560000576897E-7,
AGESEHREEVPVTTSR,ph,S,556,true,"TOR Kinase and ABA Receptor",100,29290610,XCorr,2.8327138,1.0000000,,,,0.00089959998149425,
AGESEHREEVPVTTSR,ph,S,556,true,"Phospho cell culture sucrose/TOR",109,30833711,,,0.9997290,,,,,
AGESEHREEVPVTTSR,ph,S,556,true,"Tissue atlas Arabidopsis - ProteomicsDB",114,32188942,"MaxQuant score",69.1330000,0.9999960,,,,0.00014490800094791,
