Peptide,PTM,ModifiedAA,ModifiedPosition,PeptideUniqueToGene,ExperimentDesc,ExpID,PubmedID,ScoreType,IdentScore,LocProb,Log2FChange,PQ-val,QuantSig,PEP,MassErrorPPM
SARVETEVIPVSPEDVPN,nt,S,64,true,"HUNTER N-terminome: legumain, GluC and trypsin",119,31951383,"MaxQuant score",78.7630000,,,,,,
ARVETEVIPVSPEDVPNREEQLER,nt,A,65,true,"Stromal N-terminome",96,26371235,"MASCOT Score",66.1200000,,,,,,
ARVETEVIPVSPEDVPNREEQLER,nt,A,65,true,"HUNTER N-terminome: legumain, GluC and trypsin",119,31951383,"MaxQuant score",86.2360000,,,,,,
ARVETEVIPVSPEDVPNR,nt,A,65,true,"Arg/N-end rule pathway Roots",80,25728785,"MASCOT Score",40.2400000,,,,,0.0022859999444336,
ARVETEVIPVSPEDVPNR,nt,A,65,true,"FtsH12 N-terminome: WT / FtsH12 knockdown miRNA",118,33216923,"MaxQuant score",57.4840000,,,,,0.0031502000056207,
ARVETEVIPVSPEDVPNR,nt,A,65,true,"HUNTER N-terminome: legumain, GluC and trypsin",119,31951383,"MaxQuant score",106.7500000,,,,,,
ARVETEVIPVSPEDVPN,nt,A,65,true,"HUNTER N-terminome: legumain, GluC and trypsin",119,31951383,"MaxQuant score",88.0870000,,,,,,
RVETEVIPVSPEDVPNREEQLER,nt,R,66,true,"Arabidopsis translation initiation landscape - NT",167b,35069635,,,,,,,,
IVCTVGPSTNTR,ox,C,116,true,"OxiTRAQ Arabidopsis - 5 mM H2O2 versus control",47,24376095,,,,0.2976487,0.0412877,NO,,
IVCTVGPSTNTR,so,C,116,true,"S-sulfenylation site detection using YAP1C",110,32714340,,,,,,,,
CEVVDGGELK,ox,C,250,true,"OxiTRAQ Arabidopsis - 5 mM H2O2 versus control",47,24376095,,,,0.0555301,0.0505543,NO,,
DSVKCEVVDGGELK,so,C,250,true,"Arabidopsis S-sulfenylation chemoproteomics",108,31578252,"pFind PSM Score",0.0488127,,1.0317400,,,,-0.8796607
CEVVDGGELK,so,C,250,true,"S-sulfenylation site detection using YAP1C",110,32714340,,,,,,,,
GKSATLPSITEK,ac,K,269,true,"Quantitative Acetylproteomics",101,29440448,,,,,,,,
SMIVHPTPTRAE,nt,S,388,true,"N-terminal ChaFRADIC",92,26010716,"MASCOT Score",25.4400000,,,,,9.973000123864E-5,
SMIVHPTPTRAE,nt,S,388,true,"Arabidopsis translation initiation landscape - NT",167b,35069635,,,,,,,,
SQSTHNIQVRKV,nt,S,568,true,"Arabidopsis translation initiation landscape - NT",167b,35069635,,,,,,,,
SQSTHNIQVR,ph,S,570,true,"atm and atr DNA damage response",88,25561503,"MASCOT Score",38.0000000,1.0000000,,,,,0.2600000
SQSTHNIQVR,ph,S,570,true,"Phospho cell culture sucrose/TOR",109,30833711,,,0.9984630,,,,,
SQSTHNIQVR,ph,S,570,true,"Tissue atlas Arabidopsis - ProteomicsDB",114,32188942,"MaxQuant score",104.8100000,0.9934150,,,,0.00029822200303897,
