Peptide,PTM,ModifiedAA,ModifiedPosition,PeptideUniqueToGene,ExperimentDesc,ExpID,PubmedID,ScoreType,IdentScore,LocProb,Log2FChange,PQ-val,QuantSig,PEP,MassErrorPPM
MIISEANRK,mox,M,1,true,"cat2 Methionine oxidation - 1h stress",62a,25693801,"MASCOT Score",66.0000000,,-0.7825803,,NO,,
MIISEANR,nta,M,1,true,"Arg/N-end rule seed, prt6 vs. Wt",99,29168982,"MASCOT Score",53.7600000,,,,,0.097630001604557,-0.3509662
MIISEANR,nta,M,1,true,"FtsH12 N-terminome: WT / FtsH12 knockdown miRNA",118,33216923,"MaxQuant score",110.9200000,,,,,0.0029537999071181,
EGVCFAK,ox,C,21,false,"OxiTRAQ Arabidopsis - 5 mM H2O2 versus control",47,24376095,,,,-0.5434202,0.0153699,YES,,
EGVCFAK,sno,C,21,false,"hot5-4 / wildtype, FAT-switch S-nitrosoproteome",169,37277371,,,,0.1067356,0.3480506,NO,,
EGVCFAKK,ac,K,24,false,"Histone deacetylases - apicidin vs control",98a,29061669,"MaxQuant Score",120.9000000,1.0000000,0.0560000,0.7516229,NO,0.0070000002160668,
LMQSFKSK,ac,K,50,false,"Quantitative Acetylproteomics",101,29440448,,,,,,,,
TYLNLPSDVVPATLKK,ub,K,92,false,"upl3 mutant / wildtype",168,35926874,"MaxQuant score",81.5260000,1.0000000,-0.1844246,,,1.9437400624156E-5,0.2827700
KSAKPGGRPFGGPPGDR,ub,K,93,false,"upl3 mutant / wildtype",168,35926874,"MaxQuant score",85.5630000,1.0000000,0.2678354,0.6437400,NO,1.8918299247161E-5,-0.5576400
KSAKPGGRPFGGPPGDR,ub,K,96,false,"upl3 mutant / wildtype",168,35926874,"MaxQuant score",85.5630000,1.0000000,0.2678354,0.6437400,NO,1.8918299247161E-5,-0.5576400
SAKPGGRPFGGPPGDR,ub,K,96,false,"Ubiquitination Membrane Proteins",120,33585938,,,,,,,,
SAKPGGRPFGGPPGDR,ub,K,96,false,"upl3 mutant / wildtype",168,35926874,"MaxQuant score",78.0780000,1.0000000,0.2003788,0.5872200,NO,2.94726996799E-5,-0.8421400
PFGGPPGDR,nt,P,101,false,"Arg/N-end rule seed, prt6 vs. Wt",99,29168982,"MASCOT Score",42.5800000,,,,,0.1300999969244,1.2340209
PFGGPPGDR,nta,P,101,false,"Arg/N-end rule seed, prt6 vs. Wt",99,29168982,"MASCOT Score",42.5800000,,,,,0.1300999969244,1.2340209
PGGRPFGGPPGDRSR,ph,S,110,true,"Phospho cell culture sucrose/TOR",109,30833711,,,1.0000000,,,,,
PGGRPFGGPPGDRSR,ph,S,110,true,"Tissue atlas Arabidopsis - ProteomicsDB",114,32188942,"MaxQuant score",149.8300000,1.0000000,,,,3.5576199763909E-8,
PFGGPPGDRSR,ph,S,110,true,"atm and atr DNA damage response",88,25561503,"MASCOT Score",30.0000000,1.0000000,,,,,0.2700000
AGPRAGGEFGGEK,me1,R,134,true,"Arabidopsis protein methylome",123,31809900,"MaxQuant Score",61.4090000,1.0000000,,,,2.4223400032497E-5,-0.1763000
GGAPADYQPSFQGSGR,ph,S,153,true,"Tissue atlas Arabidopsis - ProteomicsDB",114,32188942,"MaxQuant score",138.7300000,0.9801950,,,,2.7101700439403E-8,
GGAPADYQPSFQGSGR,ph,S,157,true,"Tissue atlas Arabidopsis - ProteomicsDB",114,32188942,"MaxQuant score",278.8800000,0.9999450,,,,0,
GGAPADYQPSFQGSGRGFGRGAGGYSAAAPSGSGLP,me2,R,159,true,"Arabidopsis protein methylome",123,31809900,"MaxQuant Score",70.0940000,1.0000000,,,,1.4947499430329E-17,0.0539490
GFGRGAGGYSAAAPSGSGLP,me1,R,163,true,"Arabidopsis protein methylome",123,31809900,"MaxQuant Score",42.0680000,1.0000000,,,,0.0028822200838476,0.1311200
GGAPADYQPSFQGSGRGFGRGAGGYSAAAPSGSGLP,me2,R,163,true,"Arabidopsis protein methylome",123,31809900,"MaxQuant Score",70.0940000,1.0000000,,,,1.4947499430329E-17,0.0539490
