Peptide,PTM,ModifiedAA,ModifiedPosition,PeptideUniqueToGene,ExperimentDesc,ExpID,PubmedID,ScoreType,IdentScore,LocProb,Log2FChange,PQ-val,QuantSig,PEP,MassErrorPPM
ADAETFAFQAEINQLL,nta,A,2,false,"Characterization plant N-terminal acetylation",6,22223895,"MASCOT Score",48.2900000,,,,,,
ADAETFAFQAEINQLL,nta,A,2,false,"Arabidopsis translation initiation landscape - NTA",167a,35069635,,,,,,,,
LIINTFYSNKE,nt,L,19,false,"Arabidopsis translation initiation landscape - NT",167b,35069635,,,,,,,,
TFYSNKE,nt,T,23,false,"Arg/N-end rule seed, prt6 vs. Wt",99,29168982,"MASCOT Score",23.1400000,,,,,0.0030340000521392,0.1723742
ELISNSSDALDK,ph,S,40,false,"Tissue atlas Arabidopsis - ProteomicsDB",114,32188942,"MaxQuant score",102.7300000,0.7791400,,,,0.0001112780009862,
IRFESLTDKSK,ac,K,54,false,"Quantitative Acetylproteomics",101,29440448,,,,,,,,
FESLTDKSK,ac,K,54,false,"Quantitative Acetylproteomics",101,29440448,,,,,,,,
IRFESLTDKSK,ub,K,54,false,"upl3 mutant / wildtype",168,35926874,"MaxQuant score",86.8980000,1.0000000,0.2521734,0.7013400,NO,0.0079127503558993,-1.1432000
SGIGMTKADLVNNLGTIARSGTKE,nt,S,81,false,"Arabidopsis translation initiation landscape - NT",167b,35069635,,,,,,,,
EISDDEDEDEPKKENEGEVEEVDEEK,ph,S,219,true,"Phytohormone-responsive phosphoproteins",34,20374526,"MASCOT Score",40.0000000,,,,,,2.2016900
EISDDEDEDEPKKENEGEVEEVDEEK,ph,S,219,true,"STN8 phosphoproteome",38,21768351,"MASCOT Score",53.2300000,,,,,,-0.8495540
EISDDEDEDEPKKENEGEVEEVDEEK,ph,S,219,true,"Chloroplast kinase substrates",60,19376835,"MASCOT Score",45.9300000,,,,,,-0.8495540
EISDDEDEDEPKKENEGEVEEVDEEK,ph,S,219,true,"srk2dei ABA signaling phopshoproteomics",83,23572148,"MASCOT Score",69.0000000,,,,,,0.0013000
EISDDEDEDEPKKENEGEVEEVDEEK,ph,S,219,true,"Brassinosteroid-Regulated Phosphorylation Dynamics",94,26187819,"MaxQuant Score",196.8000000,1.0000000,,,,4.1459999276841E-26,0.6200000
TTEKEISDDEDEDEPKK,ph,S,219,true,"Tyrosine phosphorylation in Arabidopsis",59,18463617,"MASCOT Score",26.0000000,,,,,,-0.5271113
TTEKEISDDEDEDEPKK,ph,S,219,true,"Phospho cell culture sucrose/TOR",109,30833711,,,1.0000000,,,,,
TTEKEISDDEDEDEPK,ph,S,219,true,"Phosphorylation nuclei-enriched fractions",28,19245862,,,,,,,,
TTEKEISDDEDEDEPK,ph,S,219,true,"STN8 phosphoproteome",38,21768351,"MASCOT Score",66.3700000,,,,,,-1.4965500
TTEKEISDDEDEDEPK,ph,S,219,true,"Phosphoproteome iron-deficient Arabidopsis roots",41,22438062,"MASCOT Score",44.7700000,,,,,,
TTEKEISDDEDEDEPK,ph,S,219,true,"LAXIC - mannitol vs control",84b,23660473,XCorr,4.0600000,1.0000000,,,,0.00012877699919045,
TTEKEISDDEDEDEPK,ph,S,219,true,"SnRK2 protein kinase substrates",85,23776212,XCorr,4.0858850,1.0000000,,,,0.00060522300191224,
TTEKEISDDEDEDEPK,ph,S,219,true,"Col-0 callus - FC Col-0 vs. Col-0 Xray",111a,31410901,,69.3000000,,2.2855525,0.0000000,NO,,0.7702544
TTEKEISDDEDEDEPK,ph,S,219,true,"Col-0 X-ray callus - FC Col-0 vs. Col-0 Xray",111b,31410901,,69.3000000,,2.2855525,0.0000000,NO,,0.7702544
TTEKEISDDEDEDEPK,ph,S,219,true,"atm callus - FC atm vs. atm Xray",111c,31410901,,69.3000000,,0.0603867,0.0000000,NO,,0.7702544
TTEKEISDDEDEDEPK,ph,S,219,true,"atm-3 X-ray callus - FC atm vs. atm Xray",111d,31410901,,69.3000000,,0.0603867,0.0000000,NO,,0.7702544
TTEKEISDDEDEDEPK,ph,S,219,true,"Tissue atlas Arabidopsis - ProteomicsDB",114,32188942,"MaxQuant score",416.6500000,1.0000000,,,,0,
EISDDEDEDEPKK,ph,S,219,true,"Tyrosine phosphorylation in Arabidopsis",59,18463617,"MASCOT Score",47.0000000,,,,,,-0.4300777
EISDDEDEDEPKK,ph,S,219,true,"srk2dei ABA signaling phopshoproteomics",83,23572148,"MASCOT Score",41.0000000,,,,,,-0.0003000
EISDDEDEDEPKK,ph,S,219,true,"TOR Kinase and ABA Receptor",100,29290610,XCorr,3.2912920,1.0000000,,,,7.9819998063613E-5,
EISDDEDEDEPK,ph,S,219,true,"STN8 phosphoproteome",38,21768351,"MASCOT Score",64.8600000,,,,,,-1.2176800
EISDDEDEDEPK,ph,S,219,true,"Tyrosine phosphorylation in Arabidopsis",59,18463617,"MASCOT Score",30.0000000,,,,,,-0.2000642
EISDDEDEDEPK,ph,S,219,true,"Chloroplast kinase substrates",60,19376835,"MASCOT Score",65.5800000,,,,,,-0.7248470
EISDDEDEDEPK,ph,S,219,true,"srk2dei ABA signaling phopshoproteomics",83,23572148,"MASCOT Score",63.0000000,,,,,,0.0015000
EISDDEDEDEPK,ph,S,219,true,"LAXIC - mannitol vs control",84b,23660473,XCorr,3.4300000,1.0000000,,,,1.4200000464371E-7,
EISDDEDEDEPK,ph,S,219,true,"atm and atr DNA damage response",88,25561503,"MASCOT Score",72.0000000,1.0000000,,,,,-0.8600000
EISDDEDEDEPK,ph,S,219,true,"TOR Kinase and ABA Receptor",100,29290610,XCorr,3.4303410,1.0000000,,,,0.0012329999590293,
ENEGEVEEVDEEKEK,nt,E,230,true,"Arabidopsis translation initiation landscape - NT",167b,35069635,,,,,,,,
HLAVKHFSVE,nt,H,295,false,"Arabidopsis translation initiation landscape - NT",167b,35069635,,,,,,,,
AILFVPKRAPF,nt,A,311,false,"Arabidopsis translation initiation landscape - NT",167b,35069635,,,,,,,,
AILFVPKR,ac,K,317,false,"Quantitative Acetylproteomics",101,29440448,,,,,,,,
ETLQQNKILK,ac,K,379,false,"Quantitative Acetylproteomics",101,29440448,,,,,,,,
ETLQQNKILK,ub,K,379,false,"upl3 mutant / wildtype",168,35926874,"MaxQuant score",96.1430000,1.0000000,-0.3147326,,,0.0017616599798203,0.4960300
CIEMFNEIAENKEDYTK,ox,C,392,true,"OxiTRAQ SA and flg22 responses - SA vs mock",91a,25720653,"MASCOT Score",34.0900000,,0.2750070,0.1950000,NO,,
CIEMFNEIAENKEDYTK,ox,C,392,true,"OxiTRAQ SA and flg22 responses - flg22 vs mock",91b,25720653,"MASCOT Score",34.0900000,,0.6690268,0.0110000,YES,,
CIEMFNEIAENKEDYTK,so,C,392,true,"S-sulfenylation site detection using YAP1C",110,32714340,,,,,,,,
SKNLKLGIHEDSQNR,nt,S,414,false,"Arabidopsis translation initiation landscape - NT",167b,35069635,,,,,,,,
FYEAFSKNLK,ac,K,415,false,"Quantitative Acetylproteomics",101,29440448,,,,,,,,
GIHEDSQNR,nt,G,420,false,"Arg/N-end rule seed, prt6 vs. Wt",99,29168982,"MASCOT Score",35.9100000,,,,,0.096589997410774,-0.2021901
LGIHEDSQNR,ph,S,425,false,"Phospho cell culture sucrose/TOR",109,30833711,,,1.0000000,,,,,
LGIHEDSQNR,ph,S,425,false,"Tissue atlas Arabidopsis - ProteomicsDB",114,32188942,"MaxQuant score",109.1500000,1.0000000,,,,0.00022444799833465,
LLRYHSTKSGDE,nt,L,434,false,"Arabidopsis translation initiation landscape - NT",167b,35069635,,,,,,,,
DYVTRMK,mox,M,456,false,"cat2 Methionine oxidation - 3h stress",62b,25693801,"MASCOT Score",31.0000000,,-0.6964445,,NO,,
YMVDAIDE,nt,Y,492,false,"Arg/N-end rule seed, prt6 vs. Wt",99,29168982,"MASCOT Score",32.6900000,,,,,0.032699998468161,-0.1866760
SFENLCK,sno,C,545,true,"hot5-4 / wildtype, FAT-switch S-nitrosoproteome",169,37277371,,,,,,,,
SFENLCK,so,C,545,true,"S-sulfenylation site detection using YAP1C",110,32714340,,,,,,,,
VVVSDRIVDSPCCLVTGEYGWTANMER,cn,C,570,true,"Cellular regulation by S-cyanylation",115,30377236,,,,,,,,
VVVSDRIVDSPCCLVTGEYGWTANMER,cn,C,571,true,"Cellular regulation by S-cyanylation",115,30377236,,,,,,,,
IMKAQALR,me1,K,588,false,"Arabidopsis protein methylome",123,31809900,"MaxQuant Score",211.8700000,1.0000000,,,,0,-0.3127500
DSSMSGYMSSK,ph,S,598,true,"Tissue atlas Arabidopsis - ProteomicsDB",114,32188942,"MaxQuant score",60.1570000,0.9782860,,,,0.008909129537642,
DSSMSGYMSSKK,ac,K,604,true,"Quantitative Acetylproteomics",101,29440448,,,,,,,,
ETALLTSGFSLDEPNTFAAR,nt,E,641,true,"Arabidopsis translation initiation landscape - NT",167b,35069635,,,,,,,,
