Peptide,PTM,ModifiedAA,ModifiedPosition,PeptideUniqueToGene,ExperimentDesc,ExpID,PubmedID,ScoreType,IdentScore,LocProb,Log2FChange,PQ-val,QuantSig,PEP,MassErrorPPM
SMEATELQDLSDDADYAASQQQGSASMMR,nt,S,2,true,"FtsH12 N-terminome: WT / FtsH12 knockdown miRNA",118,33216923,"MaxQuant score",159.8200000,,3.4434679,0.0003921,YES,0,
SMEATELQDLSDDADYAASQQQGSASMMR,nta,S,2,true,"Characterization plant N-terminal acetylation",6,22223895,"MASCOT Score",63.7300000,,,,,,
SMEATELQDLSDDADYAASQQQGSASMMR,nta,S,2,true,"Arabidopsis translation initiation landscape - NTA",167a,35069635,,,,,,,,
MSMEATELQDLSDDADYAASQQQGSASMMR,fuc,S,25,true,"SPINDLY O-fucosylation",162,36739885,,,,,,,-3.2000000476837,
MSMEATELQDLSDDADYAASQQQGSASMMR,fuc,S,27,true,"SPINDLY O-fucosylation",162,36739885,,,,,,,-3.2000000476837,
SLQSEHEDAVLIYLK,ph,S,37,true,"Tissue atlas Arabidopsis - ProteomicsDB",114,32188942,"MaxQuant score",91.6570000,0.9580610,,,,8.082819840638E-5,
SLQSEHEDAVLIYLK,ph,S,40,true,"Tissue atlas Arabidopsis - ProteomicsDB",114,32188942,"MaxQuant score",176.1100000,0.9999810,,,,1.7994400191514E-18,
SSEDQNVFIVNDFQSPLQR,ph,S,178,true,"Tissue atlas Arabidopsis - ProteomicsDB",114,32188942,"MaxQuant score",136.8100000,1.0000000,,,,2.3172100343535E-15,
TLSSLELPSSLPVASGQSVYPLDGGSSSENQR,ph,T,183,true,"Large-scale phosphorylation discovery",44,23111157,XCorr,5.1400000,,,,,,
RTSSDVGNRVSSVSQSGFR,ph,S,225,true,"Tissue atlas Arabidopsis - ProteomicsDB",114,32188942,"MaxQuant score",121.3300000,0.9413050,,,,3.451389903584E-14,
VSSVSQSGFR,ph,S,226,true,"Tissue atlas Arabidopsis - ProteomicsDB",114,32188942,"MaxQuant score",129.8200000,0.9999410,,,,3.6307901609689E-5,
VSSVSQSGFR,ph,S,228,true,"Tissue atlas Arabidopsis - ProteomicsDB",114,32188942,"MaxQuant score",115.3300000,0.9573650,,,,0.00018530900706537,
DLSIHLLEK,ph,S,245,true,"Tissue atlas Arabidopsis - ProteomicsDB",114,32188942,"MaxQuant score",160.9100000,1.0000000,,,,0.00010713499796111,
DTTTQLFSENNGFGSIDKR,ph,S,275,true,"Tissue atlas Arabidopsis - ProteomicsDB",114,32188942,"MaxQuant score",141.1900000,0.9999380,,,,9.7048601408314E-17,
RWNNQPVHSYPEK,ph,S,287,true,"srk2dei ABA signaling phopshoproteomics",83,23572148,"MASCOT Score",34.0000000,,,,,,-0.0019000
RWNNQPVHSYPEK,ph,S,287,true,"TOR Kinase and ABA Receptor",100,29290610,XCorr,4.0426965,0.9144000,,,,0.00014150000060908,
WNNQPVHSYPEK,ph,S,287,true,"STN8 phosphoproteome",38,21768351,"MASCOT Score",58.4400000,,,,,,-0.8713040
WNNQPVHSYPEK,ph,S,287,true,"Chloroplast kinase substrates",60,19376835,"MASCOT Score",58.9300000,,,,,,-0.8713040
WNNQPVHSYPEK,ph,S,287,true,"atm and atr DNA damage response",88,25561503,"MASCOT Score",47.0000000,0.9480000,,,,,-0.1300000
WNNQPVHSYPEK,ph,S,287,true,"Tissue atlas Arabidopsis - ProteomicsDB",114,32188942,"MaxQuant score",264.9700000,1.0000000,,,,0,
HSYSENDLLKDDEISYIDVPADPLEFDK,ph,S,308,true,"srk2dei ABA signaling phopshoproteomics",83,23572148,"MASCOT Score",26.0000000,,,,,,-0.0053000
HSYSENDLLKDDEISYIDVPADPLEFDK,ph,S,308,true,"SnRK2 protein kinase substrates",85,23776212,XCorr,3.0168905,0.8080000,,,,0.0015301100211218,
HSYSENDLLK,ph,S,308,true,"STN8 phosphoproteome",38,21768351,"MASCOT Score",55.1400000,,,,,,-0.8374180
HSYSENDLLK,ph,S,308,true,"Tyrosine phosphorylation in Arabidopsis",59,18463617,"MASCOT Score",56.0000000,,,,,,-0.7006411
HSYSENDLLK,ph,S,308,true,"Chloroplast kinase substrates",60,19376835,"MASCOT Score",44.2300000,,,,,,0.0642162
HSYSENDLLK,ph,S,308,true,"srk2dei ABA signaling phopshoproteomics",83,23572148,"MASCOT Score",71.0000000,,,,,,0.0003000
HSYSENDLLK,ph,S,308,true,"atm and atr DNA damage response",88,25561503,"MASCOT Score",46.0000000,0.9970000,,,,,0.0700000
HSYSENDLLK,ph,S,308,true,"Lateral root-induction - NAA vs control",106,23328941,"MASCOT Score",22.0000000,,,,,,
HSYSENDLLK,ph,S,308,true,"Phospho cell culture sucrose/TOR",109,30833711,,,0.9998750,,,,,
HSYSENDLLK,ph,S,308,true,"Tissue atlas Arabidopsis - ProteomicsDB",114,32188942,"MaxQuant score",195.7200000,0.9999890,,,,0,
HSYSENDLLKDDEISYIDVPADPLEFDK,ph,S,319,true,"srk2dei ABA signaling phopshoproteomics",83,23572148,"MASCOT Score",37.0000000,,,,,,-0.0014000
