Peptide,PTM,ModifiedAA,ModifiedPosition,PeptideUniqueToGene,ExperimentDesc,ExpID,PubmedID,ScoreType,IdentScore,LocProb,Log2FChange,PQ-val,QuantSig,PEP,MassErrorPPM
FIEENKDQTLSKEDSFK,ph,S,160,true,"Tissue atlas Arabidopsis - ProteomicsDB",114,32188942,"MaxQuant score",135.6300000,0.9998460,,,,1.4582300644772E-10,
SLQSNDDLEGYNQDER,ph,S,166,true,"atm and atr DNA damage response",88,25561503,"MASCOT Score",53.0000000,1.0000000,,,,,-0.0100000
SLQSNDDLEGYNQDER,ph,S,166,true,"Tissue atlas Arabidopsis - ProteomicsDB",114,32188942,"MaxQuant score",142.3500000,0.9998600,,,,2.2922299908884E-12,
NAGLGGSFDSIGESGWIDDGNAR,ph,S,193,true,"Tissue atlas Arabidopsis - ProteomicsDB",114,32188942,"MaxQuant score",41.0880000,0.9186270,,,,0.0045239799655974,
HNSVPATR,ph,S,216,true,"atm and atr DNA damage response",88,25561503,"MASCOT Score",37.0000000,1.0000000,,,,,0.1200000
HNSVPATR,ph,S,216,true,"Tissue atlas Arabidopsis - ProteomicsDB",114,32188942,"MaxQuant score",86.4630000,0.9999760,,,,0.0074987299740314,
NSPENSFQR,ph,S,247,true,"LAXIC - mannitol vs control",84b,23660473,XCorr,2.1800000,1.0000000,,,,0.00061748997541144,
NSPENSFQR,ph,S,247,true,"atm and atr DNA damage response",88,25561503,"MASCOT Score",27.0000000,1.0000000,,,,,-0.0200000
NSPENSFQR,ph,S,247,true,"TOR Kinase and ABA Receptor",100,29290610,XCorr,2.6041574,0.9876000,,,,0.00088870001491159,
NSPENSFQR,ph,S,247,true,"Tissue atlas Arabidopsis - ProteomicsDB",114,32188942,"MaxQuant score",144.3500000,1.0000000,,,,8.5174302512314E-5,
GFSSVTESSDPIER,ph,S,257,true,"TOR Kinase and ABA Receptor",100,29290610,XCorr,4.1210041,0.8829000,,,,0.00046949999523349,
GFSSVTESSDPIER,ph,S,257,true,"Tissue atlas Arabidopsis - ProteomicsDB",114,32188942,"MaxQuant score",220.9700000,0.9987920,,,,0,
LEQQECSNAEDEYLDSK,ph,S,482,true,"Tissue atlas Arabidopsis - ProteomicsDB",114,32188942,"MaxQuant score",164.8800000,0.9999990,,,,3.5873301154098E-17,
