Peptide,PTM,ModifiedAA,ModifiedPosition,PeptideUniqueToGene,ExperimentDesc,ExpID,PubmedID,ScoreType,IdentScore,LocProb,Log2FChange,PQ-val,QuantSig,PEP,MassErrorPPM
ARSLAQEEEPPIPQPVQVGEITEEELK,ph,S,57,true,"Large-scale phosphorylation discovery",44,23111157,XCorr,6.5590000,,,,,,
ARSLAQEEEPPIPQPVQVGEITEEELK,ph,S,57,true,"TOR Kinase and ABA Receptor",100,29290610,XCorr,4.8553939,1.0000000,,,,1.5080000537182E-7,
ARSLAQEEEPPIPQPVQVGEITEEELK,ph,S,57,true,"Phospho cell culture sucrose/TOR",109,30833711,,,0.9999120,,,,,
ARSLAQEEEPPIPQPVQVGEITEEELK,ph,S,57,true,"Tissue atlas Arabidopsis - ProteomicsDB",114,32188942,"MaxQuant score",143.3500000,1.0000000,,,,0,
SLAQEEEPPIPQPVQVGEITEEELK,ph,S,57,true,"STN8 phosphoproteome",38,21768351,"MASCOT Score",60.2300000,,,,,,-1.3902400
MFYGPGGPYALFAGKDASR,ub,K,122,false,"Ubiquitination Membrane Proteins",120,33585938,,,,,,,,
MFYGPGGPYALFAGKDASR,ub,K,122,false,"upl3 mutant / wildtype",168,35926874,"MaxQuant score",63.3020000,1.0000000,0.2497487,,,9.5393297669943E-5,-0.8906000
ALAKMSFEEK,ub,K,130,true,"upl3 mutant / wildtype",168,35926874,"MaxQuant score",83.8620000,1.0000000,-0.1376478,0.8393200,NO,0.0010798600269482,0.3771300
YAKVGTVK,ub,K,166,true,"Ubiquitination Membrane Proteins",120,33585938,,,,,,,,
VAGSEPETASVSEPTENVEQDAHVTTTPGK,ph,S,181,true,"Tissue atlas Arabidopsis - ProteomicsDB",114,32188942,"MaxQuant score",325.8100000,0.9978170,,,,0,
VAGSEPETASVSEPTENVEQDAHVTTTPGK,ph,S,183,true,"Col-0 callus - FC Col-0 vs. Col-0 Xray",111a,31410901,,31.5500000,,-0.5735186,0.0000000,NO,,1.3765485
VAGSEPETASVSEPTENVEQDAHVTTTPGK,ph,S,183,true,"Col-0 X-ray callus - FC Col-0 vs. Col-0 Xray",111b,31410901,,31.5500000,,-0.5735186,0.0000000,NO,,1.3765485
VAGSEPETASVSEPTENVEQDAHVTTTPGK,ph,S,183,true,"atm callus - FC atm vs. atm Xray",111c,31410901,,31.5500000,,0.4157544,0.0000000,NO,,1.3765485
VAGSEPETASVSEPTENVEQDAHVTTTPGK,ph,S,183,true,"atm-3 X-ray callus - FC atm vs. atm Xray",111d,31410901,,31.5500000,,0.4157544,0.0000000,NO,,1.3765485
VAGSEPETASVSEPTENVEQDAHVTTTPGK,ph,S,183,true,"Tissue atlas Arabidopsis - ProteomicsDB",114,32188942,"MaxQuant score",357.3100000,0.9909610,,,,0,
VAGSEPETASVSEPTENVEQDAHVTTTPGK,ph,T,186,true,"Large-scale phosphorylation discovery",44,23111157,XCorr,4.1860000,,,,,,
VAGSEPETASVSEPTENVEQDAHVTTTPGK,ph,T,186,true,"Lateral root-induction - NAA vs control",106,23328941,"MASCOT Score",41.0000000,,,,,,
VAGSEPETASVSEPTENVEQDAHVTTTPGK,ph,T,186,true,"Col-0 callus - FC Col-0 vs. Col-0 Xray",111a,31410901,,36.5000000,,-1.3914804,0.0000000,NO,,1.4089492
VAGSEPETASVSEPTENVEQDAHVTTTPGK,ph,T,186,true,"Col-0 X-ray callus - FC Col-0 vs. Col-0 Xray",111b,31410901,,36.5000000,,-1.3914804,0.0000000,NO,,1.4089492
VAGSEPETASVSEPTENVEQDAHVTTTPGK,ph,T,186,true,"atm callus - FC atm vs. atm Xray",111c,31410901,,36.5000000,,1.0240071,0.0000000,NO,,1.4089492
VAGSEPETASVSEPTENVEQDAHVTTTPGK,ph,T,186,true,"atm-3 X-ray callus - FC atm vs. atm Xray",111d,31410901,,36.5000000,,1.0240071,0.0000000,NO,,1.4089492
VAGSEPETASVSEPTENVEQDAHVTTTPGK,ph,T,196,true,"Large-scale phosphorylation discovery",44,23111157,XCorr,4.0650000,,,,,,
VAGSEPETASVSEPTENVEQDAHVTTTPGK,ph,T,196,true,"Lateral root-induction - NAA vs control",106,23328941,"MASCOT Score",41.0000000,,0.1346539,0.6376765,NO,,
VAGSEPETASVSEPTENVEQDAHVTTTPGK,ph,T,198,true,"Tissue atlas Arabidopsis - ProteomicsDB",114,32188942,"MaxQuant score",317.8800000,0.8800840,,,,0,
TVVDKSDDAPAETVLK,ac,K,206,true,"Quantitative Acetylproteomics",101,29440448,,,,,,,,
TVVDKSDDAPAETVLK,ph,S,207,true,"Large-scale phosphorylation discovery",44,23111157,XCorr,5.1470000,,,,,,
TVVDKSDDAPAETVLK,ph,S,207,true,"Tissue atlas Arabidopsis - ProteomicsDB",114,32188942,"MaxQuant score",205.5500000,1.0000000,,,,0,
