Peptide,PTM,ModifiedAA,ModifiedPosition,PeptideUniqueToGene,ExperimentDesc,ExpID,PubmedID,ScoreType,IdentScore,LocProb,Log2FChange,PQ-val,QuantSig,PEP,MassErrorPPM
ITEPKTPYHPMMDDDGSLSPR,ph,T,34,true,"srk2dei ABA signaling phopshoproteomics",83,23572148,"MASCOT Score",25.0000000,,,,,,0.0010000
ITEPKTPYHPMMDDDGSLSPR,ph,T,34,true,"TOR Kinase and ABA Receptor",100,29290610,XCorr,3.9413562,0.9896000,,,,7.7440003224183E-5,
TPYHPMMDDDGSLSPR,ph,T,34,true,"Tissue atlas Arabidopsis - ProteomicsDB",114,32188942,"MaxQuant score",218.8400000,0.9999950,,,,0,
TPYHPMMDDDGSLSPR,ph,S,45,true,"Arabidopsis root NAA phosphoproteome",18a,27643528,"MaxQuant Score",68.6390000,1.0000000,,,,3.7780000639032E-6,-0.4740000
TPYHPMMDDDGSLSPR,ph,S,45,true,"Phosphoproteome iron-deficient Arabidopsis roots",41,22438062,"MASCOT Score",39.1500000,,,,,,
TPYHPMMDDDGSLSPR,ph,S,45,true,"PAMP-triggered phosphorylation",48,24601666,"MASCOT Score",54.5400000,,,,,,
TPYHPMMDDDGSLSPR,ph,S,45,true,"Tyrosine phosphorylation in Arabidopsis",59,18463617,"MASCOT Score",26.0000000,,,,,,-1.0538877
TPYHPMMDDDGSLSPR,ph,S,45,true,"Chloroplast kinase substrates",60,19376835,"MASCOT Score",51.9500000,,,,,,-0.3452620
TPYHPMMDDDGSLSPR,ph,S,45,true,"Conserved plant phosphoproteome - Arabidopsis",61a,20466843,"MASCOT Score",34.0000000,1.0000000,,,,,
TPYHPMMDDDGSLSPR,ph,S,45,true,"srk2dei ABA signaling phopshoproteomics",83,23572148,"MASCOT Score",61.0000000,,,,,,-0.0004000
TPYHPMMDDDGSLSPR,ph,S,45,true,"LAXIC - mannitol vs control",84b,23660473,XCorr,4.7700000,1.0000000,,,,1.1899999757294E-14,
TPYHPMMDDDGSLSPR,ph,S,45,true,"SnRK2 protein kinase substrates",85,23776212,XCorr,4.9369774,1.0000000,,,,0.00028161398950033,
TPYHPMMDDDGSLSPR,ph,S,45,true,"atm and atr DNA damage response",88,25561503,"MASCOT Score",49.0000000,1.0000000,,,,,0.2200000
TPYHPMMDDDGSLSPR,ph,S,45,true,"Brassinosteroid-Regulated Phosphorylation Dynamics",94,26187819,"MaxQuant Score",108.0800000,1.0000000,,,,0.00033740000799298,0.0520000
TPYHPMMDDDGSLSPR,ph,S,45,true,"TOR Kinase and ABA Receptor",100,29290610,XCorr,6.6994414,1.0000000,,,,2.1239999981049E-8,
TPYHPMMDDDGSLSPR,ph,S,45,true,"Lateral root-induction - NAA vs control",106,23328941,"MASCOT Score",58.0000000,,0.0719171,0.8328603,NO,,
TPYHPMMDDDGSLSPR,ph,S,45,true,"Phospho cell culture sucrose/TOR",109,30833711,,,1.0000000,,,,,
TPYHPMMDDDGSLSPR,ph,S,45,true,"Tissue atlas Arabidopsis - ProteomicsDB",114,32188942,"MaxQuant score",238.4500000,1.0000000,,,,0,
ITEPKTPYHPMMDDDGSLSPR,ph,S,47,true,"srk2dei ABA signaling phopshoproteomics",83,23572148,"MASCOT Score",25.0000000,,,,,,0.0010000
ITEPKTPYHPMMDDDGSLSPR,ph,S,47,true,"TOR Kinase and ABA Receptor",100,29290610,XCorr,3.9413562,0.9897000,,,,7.7440003224183E-5,
TPYHPMMDDDGSLSPR,ph,S,47,true,"Arabidopsis root NAA phosphoproteome",18a,27643528,"MaxQuant Score",68.6390000,1.0000000,,,,3.7780000639032E-6,-0.4740000
TPYHPMMDDDGSLSPR,ph,S,47,true,"Phosphoproteome iron-deficient Arabidopsis roots",41,22438062,"MASCOT Score",54.9500000,,,,,,
TPYHPMMDDDGSLSPR,ph,S,47,true,"Large-scale phosphorylation discovery",44,23111157,XCorr,3.7310000,,,,,,
TPYHPMMDDDGSLSPR,ph,S,47,true,"PAMP-triggered phosphorylation",48,24601666,"MASCOT Score",55.9500000,,,,,,
TPYHPMMDDDGSLSPR,ph,S,47,true,"Tyrosine phosphorylation in Arabidopsis",59,18463617,"MASCOT Score",62.0000000,,,,,,-0.8431100
TPYHPMMDDDGSLSPR,ph,S,47,true,"Chloroplast kinase substrates",60,19376835,"MASCOT Score",51.9500000,,,,,,-0.3452620
TPYHPMMDDDGSLSPR,ph,S,47,true,"Conserved plant phosphoproteome - Arabidopsis",61a,20466843,"MASCOT Score",23.0000000,1.0000000,,,,,
TPYHPMMDDDGSLSPR,ph,S,47,true,"srk2dei ABA signaling phopshoproteomics",83,23572148,"MASCOT Score",75.0000000,,,,,,-0.0007000
TPYHPMMDDDGSLSPR,ph,S,47,true,"LAXIC - ABA stress",84a,23660473,XCorr,3.6400000,0.8550000,,,,0.010542700067163,
TPYHPMMDDDGSLSPR,ph,S,47,true,"LAXIC - mannitol vs control",84b,23660473,XCorr,4.7700000,1.0000000,,,,1.1899999757294E-14,
TPYHPMMDDDGSLSPR,ph,S,47,true,"SnRK2 protein kinase substrates",85,23776212,XCorr,5.3955154,0.9980000,,,,0.00024766998831183,
TPYHPMMDDDGSLSPR,ph,S,47,true,"atm and atr DNA damage response",88,25561503,"MASCOT Score",51.0000000,1.0000000,,,,,0.3700000
TPYHPMMDDDGSLSPR,ph,S,47,true,"Brassinosteroid-Regulated Phosphorylation Dynamics",94,26187819,"MaxQuant Score",108.0800000,1.0000000,,,,0.00033740000799298,0.0520000
TPYHPMMDDDGSLSPR,ph,S,47,true,"TOR Kinase and ABA Receptor",100,29290610,XCorr,6.6994414,1.0000000,,,,2.1239999981049E-8,
TPYHPMMDDDGSLSPR,ph,S,47,true,"Lateral root-induction - NAA vs control",106,23328941,"MASCOT Score",53.0000000,,0.0448600,0.9211870,NO,,
TPYHPMMDDDGSLSPR,ph,S,47,true,"Tissue atlas Arabidopsis - ProteomicsDB",114,32188942,"MaxQuant score",295.8200000,1.0000000,,,,0,
MDDDGSLSPR,ph,S,47,true,"Tissue atlas Arabidopsis - ProteomicsDB",114,32188942,"MaxQuant score",114.7900000,0.9924220,,,,5.6245000450872E-5,
AFDECVDDMQR,ox,C,56,true,"OxiTRAQ Arabidopsis - 5 mM H2O2 versus control",47,24376095,,,,-0.4755032,0.0339313,YES,,
AFDECVDDMQR,so,C,56,true,"S-sulfenylation site detection using YAP1C",110,32714340,,,,,,,,
NVLNDAAASSSR,ph,S,76,true,"Tissue atlas Arabidopsis - ProteomicsDB",114,32188942,"MaxQuant score",132.5100000,0.7729040,,,,3.2807900424814E-5,
NVLNDAAASSSR,ph,S,77,true,"Tissue atlas Arabidopsis - ProteomicsDB",114,32188942,"MaxQuant score",212.1100000,0.7517360,,,,1.1490299763045E-31,
NVLNDAAASSSR,ph,S,78,true,"TOR Kinase and ABA Receptor",100,29290610,XCorr,2.5748758,0.8906000,,,,0.008814999833703,
KAHYDEFR,me1,K,123,true,"Arabidopsis protein methylome",123,31809900,"MaxQuant Score",139.7400000,1.0000000,,,,3.5162698611096E-23,0.0654740
KAHYDEFR,ub,K,123,true,"Arabidopsis ubiquitination COFRADIC",40,26744219,"MaxQuant Score",101.6500000,1.0000000,,,,0.012000000104308,0.4130000
SSGSFYEEEEEEDDGAK,ph,S,137,true,"srk2dei ABA signaling phopshoproteomics",83,23572148,"MASCOT Score",79.0000000,,,,,,0.0009000
SSGSFYEEEEEEDDGAK,ph,S,137,true,"atm and atr DNA damage response",88,25561503,"MASCOT Score",37.0000000,0.9130000,,,,,-1.3900000
SSGSFYEEEEEEDDGAK,ph,S,137,true,"Lateral root-induction - NAA vs control",106,23328941,"MASCOT Score",64.0000000,,,,,,
SSGSFYEEEEEEDDGAK,ph,S,138,true,"srk2dei ABA signaling phopshoproteomics",83,23572148,"MASCOT Score",72.0000000,,,,,,-0.0009000
SSGSFYEEEEEEDDGAK,ph,S,138,true,"Lateral root-induction - NAA vs control",106,23328941,"MASCOT Score",39.0000000,,,,,,
SSGSFYEEEEEEDDGAKGSK,ph,S,140,true,"Tissue atlas Arabidopsis - ProteomicsDB",114,32188942,"MaxQuant score",252.4700000,0.9999980,,,,0,
SSGSFYEEEEEEDDGAK,ph,S,140,true,"Pollen phosphoproteome Arabidopsis",43,22631563,"MASCOT Score",66.7700000,,,,,,-2.8321900
SSGSFYEEEEEEDDGAK,ph,S,140,true,"srk2dei ABA signaling phopshoproteomics",83,23572148,"MASCOT Score",99.0000000,,,,,,-0.0012000
SSGSFYEEEEEEDDGAK,ph,S,140,true,"SnRK2 protein kinase substrates",85,23776212,XCorr,4.7738061,0.9020000,,,,1.7139299701707E-10,
SSGSFYEEEEEEDDGAKGSKSETTTNSR,ub,K,156,true,"Arabidopsis ubiquitination COFRADIC",40,26744219,"MaxQuant Score",117.0300000,0.9830000,,,,0,-0.0250000
HTKGGNKELDATKTVSGTSSSSSPELI,ub,K,177,true,"Arabidopsis ubiquitination COFRADIC",40,26744219,"MaxQuant Score",68.6570000,1.0000000,,,,2.7020000345772E-14,-0.0560000
ELDATKTVSGTSSSSSPELI,ph,T,178,true,"Tissue atlas Arabidopsis - ProteomicsDB",114,32188942,"MaxQuant score",133.2900000,0.9865600,,,,1.7464299815749E-20,
TVSGTSSSSSPELI,ph,T,182,true,"Tissue atlas Arabidopsis - ProteomicsDB",114,32188942,"MaxQuant score",128.8800000,0.7993230,,,,0.00010137399658561,
TVSGTSSSSSPELI,ph,S,183,true,"srk2dei ABA signaling phopshoproteomics",83,23572148,"MASCOT Score",24.0000000,,,,,,0.0007000
TVSGTSSSSSPELI,ph,S,183,true,"atm and atr DNA damage response",88,25561503,"MASCOT Score",39.0000000,0.9150000,,,,,0.5300000
TVSGTSSSSSPELI,ph,S,183,true,"Tissue atlas Arabidopsis - ProteomicsDB",114,32188942,"MaxQuant score",150.0900000,0.8366060,,,,2.6698398869485E-7,
TVSGTSSSSSPELI,ph,S,184,true,"srk2dei ABA signaling phopshoproteomics",83,23572148,"MASCOT Score",36.0000000,,,,,,0.0006000
TVSGTSSSSSPELI,ph,S,185,true,"srk2dei ABA signaling phopshoproteomics",83,23572148,"MASCOT Score",22.0000000,,,,,,-0.0003000
TVSGTSSSSSPELI,ph,S,186,true,"srk2dei ABA signaling phopshoproteomics",83,23572148,"MASCOT Score",33.0000000,,,,,,0.0005000
TVSGTSSSSSPELI,ph,S,186,true,"atm and atr DNA damage response",88,25561503,"MASCOT Score",47.0000000,0.9620000,,,,,1.4100000
TVSGTSSSSSPELI,ph,S,186,true,"Tissue atlas Arabidopsis - ProteomicsDB",114,32188942,"MaxQuant score",144.7000000,0.8878290,,,,6.2202099115893E-7,
TVSGTSSSSSPELI,ph,S,187,true,"Phosphoproteomic analysis of seed maturation",42,22440515,"MASCOT Score",38.0000000,,,,,,-2.9400000
TVSGTSSSSSPELI,ph,S,187,true,"Tyrosine phosphorylation in Arabidopsis",59,18463617,"MASCOT Score",50.0000000,,,,,,-0.4892994
TVSGTSSSSSPELI,ph,S,187,true,"Conserved plant phosphoproteome - Arabidopsis",61a,20466843,"MASCOT Score",50.0000000,1.0000000,,,,,
TVSGTSSSSSPELI,ph,S,187,true,"srk2dei ABA signaling phopshoproteomics",83,23572148,"MASCOT Score",57.0000000,,,,,,0.0001000
TVSGTSSSSSPELI,ph,S,187,true,"LAXIC - ABA stress",84a,23660473,XCorr,3.2800000,0.9890000,,,,7.1199996455107E-5,
TVSGTSSSSSPELI,ph,S,187,true,"SnRK2 protein kinase substrates",85,23776212,XCorr,2.9508686,0.9970000,,,,5.8507902167548E-7,
TVSGTSSSSSPELI,ph,S,187,true,"atm and atr DNA damage response",88,25561503,"MASCOT Score",82.0000000,0.9980000,,,,,-0.2800000
TVSGTSSSSSPELI,ph,S,187,true,"TOR Kinase and ABA Receptor",100,29290610,XCorr,3.6823404,0.9816000,,,,0.0057310000993311,
TVSGTSSSSSPELI,ph,S,187,true,"Lateral root-induction - NAA vs control",106,23328941,"MASCOT Score",43.0000000,,,,,,
TVSGTSSSSSPELI,ph,S,187,true,"Tissue atlas Arabidopsis - ProteomicsDB",114,32188942,"MaxQuant score",113.2200000,0.8823090,,,,6.2948602135293E-5,
