Peptide,PTM,ModifiedAA,ModifiedPosition,PeptideUniqueToGene,ExperimentDesc,ExpID,PubmedID,ScoreType,IdentScore,LocProb,Log2FChange,PQ-val,QuantSig,PEP,MassErrorPPM
AVGICGSDVHYLK,sno,C,54,true,"hot5-4 / wildtype, FAT-switch S-nitrosoproteome",169,37277371,,,,0.3070724,0.0179322,NO,,
AVGICGSDVHYLK,so,C,54,true,"Arabidopsis S-sulfenylation chemoproteomics",108,31578252,"pFind PSM Score",0.1077390,,1.2820500,,,,0.6916428
CADFVVK,sno,C,66,true,"hot5-4 / wildtype, FAT-switch S-nitrosoproteome",169,37277371,,,,0.1803783,0.3559967,NO,,
CADFVVK,so,C,66,true,"S-sulfenylation site detection using YAP1C",110,32714340,,,,,,,,
EPMVIGHE,nt,E,73,true,"Arg/N-end rule seed, prt6 vs. Wt",99,29168982,"MASCOT Score",51.4700000,,-0.2234718,0.2227699,NO,0.0049640000797808,-1.7340240
YNLCPEMK,ox,C,123,true,"SPEAR - 10 mM H2O2 / mock",138a,34619326,,,,1.6393780,0.0374749,YES,,
YNLCPEMK,so,C,123,true,"S-sulfenylation site detection using YAP1C",110,32714340,,,,,,,,
QVVHPADLCFKLPEN,nt,Q,141,true,"HUNTER N-terminome: legumain, GluC and trypsin",119,31951383,"MaxQuant score",51.8410000,,,,,,
LPENVSLEEGAMCEPLSVGVHACR,ox,C,164,true,"SPEAR - 10 mM H2O2 / mock",138a,34619326,,,,2.3438007,0.0073450,YES,,
LPENVSLEEGAMCEPLSVGVHACR,so,C,174,true,"Arabidopsis S-sulfenylation chemoproteomics",108,31578252,"pFind PSM Score",0.0001512,,,,,,-1.9262843
QLGADEIVQVTTNLEDVGSEVEQIQK,ph,S,242,true,"SnRK2 protein kinase substrates",85,23776212,XCorr,3.1315715,1.0000000,,,,0.0055741700343788,
AMGSNIDVTFDCAGFNK,so,C,261,true,"S-sulfenylation site detection using YAP1C",110,32714340,,,,,,,,
VCLVGMGHGIMTVPLTPAAAR,so,C,282,true,"S-sulfenylation site detection using YAP1C",110,32714340,,,,,,,,
NTWPLCLEFLTSGK,so,C,318,true,"S-sulfenylation site detection using YAP1C",110,32714340,,,,,,,,
IDVKPLITHR,ac,K,330,true,"Quantitative Acetylproteomics",101,29440448,,,,,,,,
