Peptide,PTM,ModifiedAA,ModifiedPosition,PeptideUniqueToGene,ExperimentDesc,ExpID,PubmedID,ScoreType,IdentScore,LocProb,Log2FChange,PQ-val,QuantSig,PEP,MassErrorPPM
MMASDPKLKAEIGADGLAR,nta,M,1,true,"Arabidopsis translation initiation landscape - NTA",167a,35069635,,,,,,,,
ASDPKLKAEIGADGLAR,nta,A,3,true,"Arabidopsis translation initiation landscape - NTA",167a,35069635,,,,,,,,
EFGNLSMELK,ph,S,60,true,"Tissue atlas Arabidopsis - ProteomicsDB",114,32188942,"MaxQuant score",65.2410000,1.0000000,,,,0.0028699000831693,
AAMEHLRK,mox,M,74,true,"cat2 Methionine oxidation - 1h stress",62a,25693801,"MASCOT Score",32.0000000,,0.3853985,,NO,,
AAMEHLRK,mox,M,74,true,"cat2 Methionine oxidation - 3h stress",62b,25693801,"MASCOT Score",35.0000000,,-0.0150316,,NO,,
KKIEVSTER,ub,K,79,true,"Arabidopsis ubiquitination COFRADIC",40,26744219,"MaxQuant Score",52.2470000,0.8280000,,,,0.014000000432134,0.2820000
IHAAKLKEEEAR,ub,K,94,true,"Arabidopsis ubiquitination COFRADIC",40,26744219,"MaxQuant Score",95.2730000,1.0000000,,,,1.4330000340124E-5,0.1210000
QSLCEDLNSLVQQSSNTQYAR,so,C,120,true,"S-sulfenylation site detection using YAP1C",110,32714340,,,,,,,,
EHGQRPATAEGESK,ph,T,204,true,"Tissue atlas Arabidopsis - ProteomicsDB",114,32188942,"MaxQuant score",65.2740000,0.9998830,,,,0.0010453399736434,
GRGIGIMNK,me1,R,222,true,"Arabidopsis protein methylome",123,31809900,"MaxQuant Score",68.0160000,1.0000000,,,,0.00049661297816783,-0.3603900
GRGGWTGAGFDVDGRN,me1,R,231,true,"Arabidopsis protein methylome",123,31809900,"MaxQuant Score",101.0100000,1.0000000,,,,1.8109699937569E-14,-0.4440100
