Peptide,PTM,ModifiedAA,ModifiedPosition,PeptideUniqueToGene,ExperimentDesc,ExpID,PubmedID,ScoreType,IdentScore,LocProb,Log2FChange,PQ-val,QuantSig,PEP,MassErrorPPM
GEDAISGNLKNLTIDTRDSE,nt,G,2,true,"N-terminal ChaFRADIC",92,26010716,"MASCOT Score",36.4500000,,,,,0.00012700000661425,
GEDAISGNLKNLTIDTR,nt,G,2,true,"Arg/N-end rule pathway Roots",80,25728785,"MASCOT Score",30.9400000,,,,,0.00020759999461006,
GEDAISGNLKNLTIDTR,nt,G,2,true,"N-terminal ChaFRADIC",92,26010716,"MASCOT Score",50.2900000,,,,,8.0559999332763E-5,
GEDAISGNLKNLTIDTR,nt,G,2,true,"Arg/N-end rule seed, prt6 vs. Wt",99,29168982,"MASCOT Score",25.1100000,,,,,0.0098280003294349,-1.4125113
GEDAISGNLKN,nt,G,2,true,"Arg/N-end rule seed, prt6 vs. Wt",99,29168982,"MASCOT Score",28.6100000,,,,,0.088129997253418,-1.3018662
GEDAISGN,nt,G,2,true,"Arg/N-end rule seed, prt6 vs. Wt",99,29168982,"MASCOT Score",58.1900000,,-0.3313164,0.2514092,NO,0.032239999622107,-0.2319330
GEDAISGNLKNLTIDTRDSE,nta,G,2,true,"N-terminal ChaFRADIC",92,26010716,"MASCOT Score",36.4500000,,,,,0.00012700000661425,
GEDAISGNLKNLTIDTR,nta,G,2,true,"Arg/N-end rule pathway Roots",80,25728785,"MASCOT Score",77.7400000,,,,,1.6719999829107E-9,
GEDAISGNLKNLTIDTR,nta,G,2,true,"N-terminal ChaFRADIC",92,26010716,"MASCOT Score",50.2900000,,,,,8.0559999332763E-5,
GEDAISGNLKNLTIDTR,nta,G,2,true,"Arg/N-end rule seed, prt6 vs. Wt",99,29168982,"MASCOT Score",25.1100000,,-0.0320223,0.8748330,NO,0.0098280003294349,-1.4125113
GEDAISGNLKNLTIDTR,nta,G,2,true,"FtsH12 N-terminome: WT / FtsH12 knockdown miRNA",118,33216923,"MaxQuant score",173.2400000,,,,,7.1199997286886E-11,
GEDAISGNLKNLTIDTR,nta,G,2,true,"HUNTER N-terminome: legumain, GluC and trypsin",119,31951383,"MaxQuant score",63.7270000,,,,,,
GEDAISGNLKNLTIDTR,nta,G,2,true,"Arabidopsis translation initiation landscape - NTA",167a,35069635,,,,,,,,
GEDAISGNLKN,nta,G,2,true,"Arg/N-end rule seed, prt6 vs. Wt",99,29168982,"MASCOT Score",28.6100000,,-0.2012304,0.3766865,NO,0.088129997253418,-1.3018662
GEDAISGNLK,nta,G,2,true,"Characterization plant N-terminal acetylation",6,22223895,"MASCOT Score",63.8300000,,,,,,
GEDAISGNLK,ph,S,7,true,"Tissue atlas Arabidopsis - ProteomicsDB",114,32188942,"MaxQuant score",103.6300000,1.0000000,,,,0.00033118299324997,
TALAFVTLR,nt,T,108,false,"Arg/N-end rule pathway Roots",80,25728785,"MASCOT Score",40.3600000,,,,,0.040279999375343,
LLVVSEGPNGCR,ox,C,255,true,"OxiTRAQ Arabidopsis - 5 mM H2O2 versus control",47,24376095,,,,-0.2571161,0.0103353,NO,,
LLVVSEGPNGCR,so,C,255,true,"Arabidopsis S-sulfenylation chemoproteomics",108,31578252,"pFind PSM Score",0.0018236,,,,,,-0.4603507
