Peptide,PTM,ModifiedAA,ModifiedPosition,PeptideUniqueToGene,ExperimentDesc,ExpID,PubmedID,ScoreType,IdentScore,LocProb,Log2FChange,PQ-val,QuantSig,PEP,MassErrorPPM
MEVGSATKKLQCQRIGCNAMFTD,nta,M,1,true,"Arabidopsis translation initiation landscape - NTA",167a,35069635,,,,,,,,
MEVGSATK,ph,S,5,true,"Tissue atlas Arabidopsis - ProteomicsDB",114,32188942,"MaxQuant score",101.3500000,0.9946560,,,,0.00016563100507483,
MEVGSATKKLQCQR,ub,K,8,true,"Arabidopsis ubiquitination COFRADIC",40,26744219,"MaxQuant Score",107.9900000,1.0000000,,,,3.3089999629254E-9,-0.5160000
MEVGSATKKLQCQR,ub,K,9,true,"Arabidopsis ubiquitination COFRADIC",40,26744219,"MaxQuant Score",107.9900000,1.0000000,,,,3.3089999629254E-9,-0.5160000
SVPKHPVAAPTSSPDANAATK,ph,S,81,true,"Tissue atlas Arabidopsis - ProteomicsDB",114,32188942,"MaxQuant score",101.7400000,1.0000000,,,,7.7102102480353E-10,
HPVAAPTSSPDANAATK,ph,T,91,true,"Lateral root-induction - NAA vs control",106,23328941,"MASCOT Score",81.0000000,,,,,,
HPVAAPTSSPDANAATK,ph,S,93,true,"Large-scale phosphorylation discovery",44,23111157,XCorr,4.5550000,,,,,,
HPVAAPTSSPDANAATK,ph,S,93,true,"Protein sumoylation and phosphorylation cross-talk",97,28419593,,,,,,,,
HPVAAPTSSPDANAATK,ph,S,93,true,"TOR Kinase and ABA Receptor",100,29290610,XCorr,4.7521238,0.8032000,,,,4.9979998806293E-8,
HPVAAPTSSPDANAATK,ph,S,93,true,"Lateral root-induction - NAA vs control",106,23328941,"MASCOT Score",47.0000000,,,,,,
HPVAAPTSSPDANAATK,ph,S,93,true,"Tissue atlas Arabidopsis - ProteomicsDB",114,32188942,"MaxQuant score",331.8500000,0.9989900,,,,0,
QTLNTPGQAEEEKIEPLAPPVQK,ph,T,130,true,"Tissue atlas Arabidopsis - ProteomicsDB",114,32188942,"MaxQuant score",182.4000000,0.9999990,,,,0,
AVIDINQPQVCK,sno,C,159,true,"hot5-4 / wildtype, FAT-switch S-nitrosoproteome",169,37277371,,,,,,,,
AVIDINQPQVCK,so,C,159,true,"S-sulfenylation site detection using YAP1C",110,32714340,,,,,,,,
GWHSSSPDPAV,ph,S,220,true,"Tissue atlas Arabidopsis - ProteomicsDB",114,32188942,"MaxQuant score",96.3420000,0.7588940,,,,0.00011049900058424,
GWHSSSPDPAV,ph,S,221,true,"Tissue atlas Arabidopsis - ProteomicsDB",114,32188942,"MaxQuant score",142.5500000,0.9222240,,,,5.1138801637762E-8,
