Peptide,PTM,ModifiedAA,ModifiedPosition,PeptideUniqueToGene,ExperimentDesc,ExpID,PubmedID,ScoreType,IdentScore,LocProb,Log2FChange,PQ-val,QuantSig,PEP,MassErrorPPM
TNGSDQIFDASK,ng,N,34,true,"Conserved N-glycosylation",74,22633491,"MaxQuant Score",137.9700000,1.0000000,,,,3.8369999587557E-14,-0.3970000
TNGSDQIFDASK,ng,N,34,true,"N-Glycopeptide Profiling in Arabidopsis Infloresce",132,27067053,"MOWSE score",24.1000000,,,,,0.0015999999595806,
KFEGSSNLVR,nt,K,45,true,"Arabidopsis translation initiation landscape - NT",167b,35069635,,,,,,,,
YHMGPVLTNNITVHPIWYGTWQK,ng,N,66,true,"Conserved N-glycosylation",74,22633491,"MaxQuant Score",199.0600000,0.9010000,,,,0,1.1750000
TVQLYTDQTGSNITGTVR,ng,N,119,true,"Conserved N-glycosylation",74,22633491,"MaxQuant Score",187.8900000,1.0000000,,,,0,0.1840000
TVQLYTDQTGSNITGTVR,ng,N,119,true,"N-linked Glycan Micro-heterogeneity Arabidopsis",134,29237727,,,,,,,,
TVQLYTDQTGSNITGTVR,ng,N,119,true,"UDP-GlcNAc transporter glycopeptide analysis",135,30224661,,,,,,,1.8780527003086E-17,0.6000000
FYSHGKSLTR,ac,K,139,true,"Quantitative Acetylproteomics",101,29440448,,,,,,,,
