Peptide,PTM,ModifiedAA,ModifiedPosition,PeptideUniqueToGene,ExperimentDesc,ExpID,PubmedID,ScoreType,IdentScore,LocProb,Log2FChange,PQ-val,QuantSig,PEP,MassErrorPPM
MMLDLGPFSDEKFDAKR,nta,M,1,true,"Arabidopsis translation initiation landscape - NTA",167a,35069635,,,,,,,,
MMLDLGPFSDEK,nta,M,1,true,"Characterization plant N-terminal acetylation",6,22223895,"MASCOT Score",56.0700000,,,,,,
WVNSSCQAR,so,C,23,true,"Arabidopsis S-sulfenylation chemoproteomics",108,31578252,"pFind PSM Score",0.1491070,,0.7633600,,,,-0.0027125
AEGSSADCIAALAR,sno,C,103,true,"hot5-4 / wildtype, FAT-switch S-nitrosoproteome",169,37277371,,,,0.7859161,0.0030162,YES,,
AEGSSADCIAALAR,so,C,103,true,"S-sulfenylation site detection using YAP1C",110,32714340,,,,,,,,
NCLSAVGEVAEFANVRK,so,C,159,true,"S-sulfenylation site detection using YAP1C",110,32714340,,,,,,,,
VVCGVDGTGDGVGSK,sno,C,504,true,"Site-specific nitrosomeproteomic id - gsnor1-3",90b,25699590,XCorr,2.7600000,,,,,0.046930000185966,-6.8700000
VVCGVDGTGDGVGSK,sno,C,504,true,"hot5-4 / wildtype, FAT-switch S-nitrosoproteome",169,37277371,,,,0.6551457,0.0064004,YES,,
VVCGVDGTGDGVGSK,so,C,504,true,"Arabidopsis S-sulfenylation chemoproteomics",108,31578252,"pFind PSM Score",0.0848192,,,,,,0.9356425
VVCGVDGTGDGVGSKK,ub,K,516,true,"Arabidopsis ubiquitination by TUBEs",2,23667124,,,,,,,,
SEQTAGDLSMAGR,ph,S,602,true,"Tissue atlas Arabidopsis - ProteomicsDB",114,32188942,"MaxQuant score",91.0760000,0.9999990,,,,0.00019318700651638,
ASMDVAAIR,ph,S,608,true,"Tissue atlas Arabidopsis - ProteomicsDB",114,32188942,"MaxQuant score",74.5620000,1.0000000,,,,0.0066798198968172,
SEAGNELDCPTANLVCK,sno,C,821,true,"hot5-4 / wildtype, FAT-switch S-nitrosoproteome",169,37277371,,,,,,,,
