Peptide,PTM,ModifiedAA,ModifiedPosition,PeptideUniqueToGene,ExperimentDesc,ExpID,PubmedID,ScoreType,IdentScore,LocProb,Log2FChange,PQ-val,QuantSig,PEP,MassErrorPPM
MESVEMNNPNSQTL,nta,M,1,true,"Arabidopsis translation initiation landscape - NTA",167a,35069635,,,,,,,,
TLSGNDKDQSGGEEETTSR,ph,S,77,true,"STN8 phosphoproteome",38,21768351,"MASCOT Score",43.5200000,,,,,,
TLSGNDKDQSGGEEETTSR,ph,S,77,true,"SnRK2 protein kinase substrates",85,23776212,XCorr,4.7127180,0.9000000,,,,0.011724799871445,
TLSGNDKDQSGGEEETTSR,ph,S,77,true,"Protein sumoylation and phosphorylation cross-talk",97,28419593,,,,,,,,
TLSGNDKDQSGGEEETTSR,ph,S,77,true,"Phospho cell culture sucrose/TOR",109,30833711,,,0.9989910,,,,,
TLSGNDKDQSGGEEETTSR,ph,S,77,true,"Col-0 callus - FC Col-0 vs. Col-0 Xray",111a,31410901,,52.8200000,,-0.7078422,0.0000000,NO,,0.7394395
TLSGNDKDQSGGEEETTSR,ph,S,77,true,"Col-0 X-ray callus - FC Col-0 vs. Col-0 Xray",111b,31410901,,52.8200000,,-0.7078422,0.0000000,NO,,0.7394395
TLSGNDKDQSGGEEETTSR,ph,S,77,true,"atm callus - FC atm vs. atm Xray",111c,31410901,,52.8200000,,-8.9698134,0.0000000,NO,,0.7394395
TLSGNDKDQSGGEEETTSR,ph,S,77,true,"atm-3 X-ray callus - FC atm vs. atm Xray",111d,31410901,,52.8200000,,-8.9698134,0.0000000,NO,,0.7394395
TLSGNDKDQSGGEEETTSR,ph,S,77,true,"Tissue atlas Arabidopsis - ProteomicsDB",114,32188942,"MaxQuant score",256.0600000,0.9999900,,,,0,
TLSGNDKDQSGGEEETTSRR,ph,S,84,true,"Chloroplast kinase substrates",60,19376835,"MASCOT Score",39.8000000,,,,,,-0.3836930
TLSGNDKDQSGGEEETTSR,ph,S,84,true,"Chloroplast kinase substrates",60,19376835,"MASCOT Score",53.9400000,,,,,,1.3742300
TLSGNDKDQSGGEEETTSR,ph,S,84,true,"LAXIC - mannitol vs control",84b,23660473,XCorr,3.5000000,1.0000000,,,,3.9700000797893E-7,
TLSGNDKDQSGGEEETTSR,ph,S,84,true,"SnRK2 protein kinase substrates",85,23776212,XCorr,4.7127180,1.0000000,,,,0.011724799871445,
TLSGNDKDQSGGEEETTSR,ph,S,84,true,"Protein sumoylation and phosphorylation cross-talk",97,28419593,,,,,,,,
TLSGNDKDQSGGEEETTSR,ph,S,84,true,"Phospho cell culture sucrose/TOR",109,30833711,,,0.9997640,,,,,
TLSGNDKDQSGGEEETTSR,ph,S,84,true,"Col-0 callus - FC Col-0 vs. Col-0 Xray",111a,31410901,,44.3300000,,-3.1930708,0.0000000,NO,,0.7260015
TLSGNDKDQSGGEEETTSR,ph,S,84,true,"Col-0 X-ray callus - FC Col-0 vs. Col-0 Xray",111b,31410901,,44.3300000,,-3.1930708,0.0000000,NO,,0.7260015
TLSGNDKDQSGGEEETTSR,ph,S,84,true,"atm callus - FC atm vs. atm Xray",111c,31410901,,44.3300000,,2.9348147,0.0000000,NO,,0.7260015
TLSGNDKDQSGGEEETTSR,ph,S,84,true,"atm-3 X-ray callus - FC atm vs. atm Xray",111d,31410901,,44.3300000,,2.9348147,0.0000000,NO,,0.7260015
TLSGNDKDQSGGEEETTSR,ph,S,84,true,"Tissue atlas Arabidopsis - ProteomicsDB",114,32188942,"MaxQuant score",256.0600000,1.0000000,,,,0,
DQSGGEEETTSR,ph,S,84,true,"atm and atr DNA damage response",88,25561503,"MASCOT Score",57.0000000,1.0000000,,,,,1.3900000
SRWDPPPSESINNPSAEGGTDSGTGTRK,ph,S,112,true,"Large-scale phosphorylation discovery",44,23111157,XCorr,3.4310000,,,,,,
MLQSGMPLDDRPEGQRSPSPEPVYDNMGIR,ph,S,187,true,"Phosphorylation RNA metabolism",22,16807317,,,,,,,,
MLQSGMPLDDRPEGQRSPSPEPVYDNMGIR,ph,S,187,true,"MAPK Arabidopsis substrates",45,23172892,"MaxQuant Score",90.6940000,,,,,,
MLQSGMPLDDRPEGQRSPSPEPVYDNMGIR,ph,S,187,true,"PAMP-triggered phosphorylation",48,24601666,"MASCOT Score",57.4700000,,,,,,
MLQSGMPLDDRPEGQRSPSPEPVYDNMGIR,ph,S,187,true,"Conserved plant phosphoproteome - Arabidopsis",61a,20466843,"MASCOT Score",48.0000000,1.0000000,,,,,
MLQSGMPLDDRPEGQRSPSPEPVYDNMGIR,ph,S,187,true,"srk2dei ABA signaling phopshoproteomics",83,23572148,"MASCOT Score",51.0000000,,,,,,-0.0052000
MLQSGMPLDDRPEGQRSPSPEPVYDNMGIR,ph,S,187,true,"SnRK2 protein kinase substrates",85,23776212,XCorr,3.6403439,0.9970000,,,,0.017351299524307,
MLQSGMPLDDRPEGQRSPSPEPVYDNMGIR,ph,S,187,true,"Brassinosteroid-Regulated Phosphorylation Dynamics",94,26187819,"MaxQuant Score",98.6270000,1.0000000,,,,4.1519999172124E-7,1.5120000
MLQSGMPLDDRPEGQRSPSPEPVYDNMGIR,ph,S,187,true,"TOR Kinase and ABA Receptor",100,29290610,XCorr,4.9215345,1.0000000,,,,0.00021699999342673,
MLQSGMPLDDRPEGQRSPSPEPVYDNMGIR,ph,S,187,true,"Phospho cell culture sucrose/TOR",109,30833711,,,0.9999910,,,,,
SPSPEPVYDNMGIR,ph,S,187,true,"atm and atr DNA damage response",88,25561503,"MASCOT Score",35.0000000,1.0000000,,,,,0.3400000
SPSPEPVYDNMGIR,ph,S,187,true,"Tissue atlas Arabidopsis - ProteomicsDB",114,32188942,"MaxQuant score",243.5500000,1.0000000,,,,0,
MLQSGMPLDDRPEGQRSPSPEPVYDNMGIR,ph,S,189,true,"Phosphorylation RNA metabolism",22,16807317,,,,,,,,
MLQSGMPLDDRPEGQRSPSPEPVYDNMGIR,ph,S,189,true,"MAPK Arabidopsis substrates",45,23172892,"MaxQuant Score",90.6940000,,,,,,
MLQSGMPLDDRPEGQRSPSPEPVYDNMGIR,ph,S,189,true,"PAMP-triggered phosphorylation",48,24601666,"MASCOT Score",57.4700000,,,,,,
MLQSGMPLDDRPEGQRSPSPEPVYDNMGIR,ph,S,189,true,"srk2dei ABA signaling phopshoproteomics",83,23572148,"MASCOT Score",51.0000000,,,,,,-0.0052000
MLQSGMPLDDRPEGQRSPSPEPVYDNMGIR,ph,S,189,true,"SnRK2 protein kinase substrates",85,23776212,XCorr,3.6403439,0.9970000,,,,0.017351299524307,
MLQSGMPLDDRPEGQRSPSPEPVYDNMGIR,ph,S,189,true,"Brassinosteroid-Regulated Phosphorylation Dynamics",94,26187819,"MaxQuant Score",98.6270000,0.9970000,,,,4.1519999172124E-7,1.5120000
MLQSGMPLDDRPEGQRSPSPEPVYDNMGIR,ph,S,189,true,"TOR Kinase and ABA Receptor",100,29290610,XCorr,4.9215345,0.9980000,,,,0.00021699999342673,
MLQSGMPLDDRPEGQRSPSPEPVYDNMGIR,ph,S,189,true,"Phospho cell culture sucrose/TOR",109,30833711,,,0.9996330,,,,,
SPSPEPVYDNMGIR,ph,S,189,true,"atm and atr DNA damage response",88,25561503,"MASCOT Score",35.0000000,1.0000000,,,,,0.3400000
SPSPEPVYDNMGIR,ph,S,189,true,"Tissue atlas Arabidopsis - ProteomicsDB",114,32188942,"MaxQuant score",243.5500000,1.0000000,,,,0,
MLQSGMPLDDRPEGQRSPSPEPVYDNMGIR,ph,Y,194,true,"PAMP-triggered phosphorylation",48,24601666,"MASCOT Score",34.0900000,,,,,,
GKGSVKEGR,ub,K,289,true,"Arabidopsis ubiquitination COFRADIC",40,26744219,"MaxQuant Score",82.4170000,1.0000000,,,,0.003000000026077,0.3420000
