Peptide,PTM,ModifiedAA,ModifiedPosition,PeptideUniqueToGene,ExperimentDesc,ExpID,PubmedID,ScoreType,IdentScore,LocProb,Log2FChange,PQ-val,QuantSig,PEP,MassErrorPPM
SNLAQDFLGDFGAR,nt,S,51,true,"Tic56 chloroplast import - ppi2",89b,25588737,XCorr,4.0323300,,,,,,
SNLAQDFLGDFGAR,nt,S,51,true,"Tic56 chloroplast import - tic56-1",89c,25588737,XCorr,3.0695410,,,,,,
SNLAQDFLGDFGAR,nt,S,51,true,"Stromal N-terminome",96,26371235,"MASCOT Score",119.1900000,,,,,,
SNLAQDFLGDFGAR,nt,S,51,true,"FtsH12 N-terminome: WT / FtsH12 knockdown miRNA",118,33216923,"MaxQuant score",105.8600000,,,,,1.0000000237422E-32,
NLAQDFLGDFGARDPYPEE,nt,N,52,true,"Stromal N-terminome",96,26371235,"MASCOT Score",50.4800000,,,,,,
NLAQDFLGDFGARDPYPEE,nt,N,52,true,"HUNTER N-terminome: legumain, GluC and trypsin",119,31951383,"MaxQuant score",89.4660000,,,,,,
NLAQDFLGDFGAR,nt,N,52,true,"Tic56 chloroplast import - tic56-1",89c,25588737,XCorr,2.8300366,,,,,,
NLAQDFLGDFGAR,nt,N,52,true,"Stromal N-terminome",96,26371235,"MASCOT Score",94.4200000,,,,,,
NLAQDFLGDFGAR,nt,N,52,true,"Arg/N-end rule seed, prt6 vs. Wt",99,29168982,"MASCOT Score",54.4600000,,0.1048731,0.6241305,NO,0.00038849998963997,-0.9847280
NLAQDFLGDFGAR,nt,N,52,true,"FtsH12 N-terminome: WT / FtsH12 knockdown miRNA",118,33216923,"MaxQuant score",180.8300000,,-0.6044648,0.0222630,YES,0,
NLAQDFLGDFGAR,nt,N,52,true,"HUNTER N-terminome: legumain, GluC and trypsin",119,31951383,"MaxQuant score",147.7200000,,,,,,
NLAQDFLGDFGAR,nt,N,52,true,"Arabidopsis translation initiation landscape - NT",167b,35069635,,,,,,,,
NLAQDFLGDFGAR,nta,N,52,true,"Stromal N-terminome",96,26371235,"MASCOT Score",58.5700000,,,,,,
NLAQDFLGDFGAR,nta,N,52,true,"HUNTER N-terminome: legumain, GluC and trypsin",119,31951383,"MaxQuant score",65.8420000,,,,,,
VLGCQSTEHK,sno,C,82,true,"hot5-4 / wildtype, FAT-switch S-nitrosoproteome",169,37277371,,,,0.6154305,0.0000089,YES,,
VLGCQSTEHK,so,C,82,true,"S-sulfenylation site detection using YAP1C",110,32714340,,,,,,,,
SPVSSSQPPLSGDDAR,nt,S,105,true,"Arg/N-end rule seed, prt6 vs. Wt",99,29168982,"MASCOT Score",41.3700000,,-0.3526555,0.0778360,NO,0.0048989998176694,-3.3317534
DFGCGVELINR,sno,C,152,true,"hot5-4 / wildtype, FAT-switch S-nitrosoproteome",169,37277371,,,,0.8205758,0.0030413,YES,,
IDDIKTSDLSPR,ac,K,208,true,"Quantitative Acetylproteomics",101,29440448,,,,,,,,
