Peptide,PTM,ModifiedAA,ModifiedPosition,PeptideUniqueToGene,ExperimentDesc,ExpID,PubmedID,ScoreType,IdentScore,LocProb,Log2FChange,PQ-val,QuantSig,PEP,MassErrorPPM
GPDPDLVAIAER,nt,G,43,true,"Metacaspase9 substrates - in vitro rMC9",51c,23964026,"MASCOT Score",55.0000000,,,,,,-0.2269825
EVSFCK,sno,C,220,true,"hot5-4 / wildtype, FAT-switch S-nitrosoproteome",169,37277371,,,,,,,,
KEVSFCK,so,C,220,true,"Arabidopsis S-sulfenylation chemoproteomics",108,31578252,"pFind PSM Score",0.0697517,,0.9889900,,,,0.7031844
LATETGSSINVTEDVIACLR,so,C,266,true,"S-sulfenylation site detection using YAP1C",110,32714340,,,,,,,,
NAPELLDIVACSEVFDSSGGGAER,so,C,280,true,"S-sulfenylation site detection using YAP1C",110,32714340,,,,,,,,
VPMDPQLCK,sno,C,313,true,"hot5-4 / wildtype, FAT-switch S-nitrosoproteome",169,37277371,,,,0.3928627,0.0015386,NO,,
SCFEDNK,ox,C,322,true,"OxiTRAQ Arabidopsis - 5 mM H2O2 versus control",47,24376095,,,,1.3465836,0.0007925,YES,,
SCFEDNK,sno,C,322,true,"hot5-4 / wildtype, FAT-switch S-nitrosoproteome",169,37277371,,,,1.0415418,0.0115685,YES,,
CLISAPALK,ox,C,328,true,"SPEAR - 50 mM H2O2 / mock",138b,34619326,,,,2.4159849,0.0088522,YES,,
CLISAPALK,sno,C,328,true,"hot5-4 / wildtype, FAT-switch S-nitrosoproteome",169,37277371,,,,,,,,
VVPSTVMTE,ph,T,349,true,"atm and atr DNA damage response",88,25561503,"MASCOT Score",42.0000000,1.0000000,,,,,-0.2500000
VVPSTVMTE,ph,T,349,true,"Tissue atlas Arabidopsis - ProteomicsDB",114,32188942,"MaxQuant score",141.0200000,0.9999980,,,,0.00011013699986506,
