Peptide,PTM,ModifiedAA,ModifiedPosition,PeptideUniqueToGene,ExperimentDesc,ExpID,PubmedID,ScoreType,IdentScore,LocProb,Log2FChange,PQ-val,QuantSig,PEP,MassErrorPPM
FTEKAIK,ac,K,101,false,"Histone deacetylases - apicidin vs control",98a,29061669,"MaxQuant Score",124.0000000,1.0000000,-0.1240000,0.6011737,NO,0.00041999999666587,
VLKSMGINLK,ac,K,143,false,"Quantitative Acetylproteomics",101,29440448,,,,,,,,
VEVEKIIGR,ac,K,158,false,"Histone deacetylases - apicidin vs control",98a,29061669,"MaxQuant Score",91.7000000,1.0000000,-0.1100000,0.6011737,NO,0.0020000000949949,
VEVEKIIGR,ac,K,158,false,"Histone deacetylases substrates - TSA vs control",98b,29061669,"MaxQuant Score",91.7000000,1.0000000,-0.0960000,0.9977001,NO,0.0020000000949949,
VEVEKIIGR,ac,K,158,false,"Histone deacetylases substrates - hda14 vs WT",98e,29061669,"MaxQuant Score",67.2000000,1.0000000,-0.1190000,0.9099133,NO,0.0049999998882413,
GSGFVAVEIPFTPR,ph,T,174,false,"TOR Kinase and ABA Receptor",100,29290610,XCorr,4.1845942,1.0000000,,,,4.0380000427831E-6,
QLGHNYIGSEHLLLGLLR,nt,Q,190,false,"HUNTER N-terminome: legumain, GluC and trypsin",119,31951383,"MaxQuant score",110.2200000,,,,,,
MPTLEEYGTNLTK,mox,M,254,false,"cat2 Methionine oxidation - 1h stress",62a,25693801,"MASCOT Score",51.0000000,,0.4963853,,NO,,
TKNNPCLIGEPGVGKTAIAEGLAQR,nt,T,294,false,"Stromal N-terminome",96,26371235,"MASCOT Score",41.6800000,,,,,,
NNPCLIGEPGVGK,sno,C,299,false,"Site-specific nitrosomeproteomic id - gsnor1-3",90a,25699590,XCorr,3.4067569,,,,,0.0067670000717044,-7.2536018
NNPCLIGEPGVGK,sno,C,299,false,"Site-specific nitrosomeproteomic id - gsnor1-3",90b,25699590,XCorr,3.2000000,,,,,0.05612999945879,-6.8300000
NNPCLIGEPGVGK,sno,C,299,false,"hot5-4 / wildtype, FAT-switch S-nitrosoproteome",169,37277371,,,,0.3086635,0.0010059,NO,,
TKNNPCLIGEPGVGK,so,C,299,false,"S-sulfenylation site detection using YAP1C",110,32714340,,,,,,,,
NNPCLIGEPGVGK,so,C,299,false,"Arabidopsis S-sulfenylation chemoproteomics",108,31578252,"pFind PSM Score",0.0035714,,1.1056500,,,,-0.7704921
IASGDVPETIEGKK,ac,K,331,true,"Quantitative Acetylproteomics",101,29440448,,,,,,,,
KLMEEIR,me2,K,357,false,"Arabidopsis protein methylome",123,31809900,"MaxQuant Score",88.9210000,1.0000000,,,,0.013912100344896,-0.0191390
GELQCIGATTLDEYRK,so,C,405,true,"S-sulfenylation site detection using YAP1C",110,32714340,,,,,,,,
CIGATTLDEYRK,so,C,405,false,"Arabidopsis S-sulfenylation chemoproteomics",108,31578252,"pFind PSM Score",0.3399780,,,,,,-0.8401352
CIGATTLDEYRK,so,C,405,false,"S-sulfenylation site detection using YAP1C",110,32714340,,,,,,,,
IGATTLDE,nt,I,406,false,"Arg/N-end rule seed, prt6 vs. Wt",99,29168982,"MASCOT Score",47.7400000,,-0.1083468,0.5957938,NO,0.022520000115037,0.0209752
KHIEKDPALER,ub,K,420,false,"Arabidopsis ubiquitination COFRADIC",40,26744219,"MaxQuant Score",43.6800000,1.0000000,,,,0.013000000268221,-0.2700000
EIHHKLRYT,nt,E,453,false,"Arabidopsis translation initiation landscape - NT",167b,35069635,,,,,,,,
SLVAAAQLS,nt,S,464,true,"N-terminal ChaFRADIC",92,26010716,"MASCOT Score",34.6300000,,,,,0.018349999561906,
FLPDKAIDLIDEAGSR,nt,F,480,false,"Metacaspase9 substrates - Col-0 / mc9",51a,23964026,"MASCOT Score",47.0000000,,2.8566965,,NO,,-1.6255653
FLPDKAIDLIDEAGSR,nt,F,480,false,"Metacaspase9 substrates - in vitro rMC9",51c,23964026,"MASCOT Score",76.0000000,,1.8744647,,NO,,-0.8952077
ELEKELR,ac,K,512,true,"Histone deacetylases substrates - hda14 vs WT",98e,29061669,"MaxQuant Score",94.9000000,1.0000000,1.0130000,0.0716143,NO,0.0099999997764826,
GQDFEKAGTLR,ub,K,532,true,"Arabidopsis ubiquitination COFRADIC",40,26744219,"MaxQuant Score",76.3320000,1.0000000,,,,0.00054129998898134,-0.0490000
AEVSAIQAKGK,ac,K,553,true,"Quantitative Acetylproteomics",101,29440448,,,,,,,,
SWTGIPVEKV,nt,S,582,true,"N-terminal ChaFRADIC",92,26010716,"MASCOT Score",20.3400000,,,,,0.00020130000484642,
MEETLHK,mox,M,602,true,"cat2 Methionine oxidation - 1h stress",62a,25693801,"MASCOT Score",32.0000000,,0.0514591,,NO,,
MEETLHK,mox,M,602,true,"cat2 Methionine oxidation - 3h stress",62b,25693801,"MASCOT Score",35.0000000,,-0.1014872,,NO,,
LLKMEETLHKR,ac,K,608,true,"Quantitative Acetylproteomics",101,29440448,,,,,,,,
MEETLHKR,ac,K,608,true,"Quantitative Acetylproteomics",101,29440448,,,,,,,,
IIGQDEAVKAISR,ub,K,618,true,"Arabidopsis ubiquitination COFRADIC",40,26744219,"MaxQuant Score",45.2800000,1.0000000,,,,0.0099999997764826,-1.6880000
NPNRPIASFIFSGPTGVGKSELAK,ac,K,651,false,"Quantitative Acetylproteomics",101,29440448,,,,,,,,
TSNVGSSVIE,nt,T,757,false,"Arg/N-end rule seed, prt6 vs. Wt",99,29168982,"MASCOT Score",61.0400000,,-0.3808993,0.3798856,NO,0.00011049999739043,1.0484331
IGFDLDYDEKDSSYNR,ac,K,781,true,"Histone deacetylases substrates - hda14 vs WT",98e,29061669,"MaxQuant Score",65.5000000,1.0000000,-0.0580000,0.9705100,NO,7.6999996963423E-5,
IKSLVTEELK,ac,K,789,false,"Quantitative Acetylproteomics",101,29440448,,,,,,,,
QLTKLEVK,ac,K,819,false,"Histone deacetylases - apicidin vs control",98a,29061669,"MaxQuant Score",102.0000000,1.0000000,0.1730000,0.4841724,NO,0.010999999940395,
QLTKLEVK,ac,K,819,false,"Quantitative Acetylproteomics",101,29440448,,,,,,,,
VVDEGYNPSYGAR,nt,V,854,true,"Stromal N-terminome",96,26371235,"MASCOT Score",41.6300000,,,,,,
MLAREIK,mox,M,884,true,"cat2 Methionine oxidation - 1h stress",62a,25693801,"MASCOT Score",49.0000000,,0.2325035,,NO,,
MLAREIK,mox,M,884,true,"cat2 Methionine oxidation - 3h stress",62b,25693801,"MASCOT Score",43.0000000,,-0.0693913,,NO,,
