Peptide,PTM,ModifiedAA,ModifiedPosition,PeptideUniqueToGene,ExperimentDesc,ExpID,PubmedID,ScoreType,IdentScore,LocProb,Log2FChange,PQ-val,QuantSig,PEP,MassErrorPPM
YAAGAKEMTVR,nt,Y,29,true,"Mitochondrial intermediate peptidases - icp55 / WT",131a,25732537,,55.0600000,,6.6438562,,,,
AAGAKEMTVRDALNSAIDEEMSADPKVF,nt,A,30,true,"Arabidopsis translation initiation landscape - NT",167b,35069635,,,,,,,,
AAGAKEMTVR,nt,A,30,true,"Arg/N-end rule pathway Roots",80,25728785,"MASCOT Score",52.2600000,,,,,6.7900000431109E-5,
AAGAKEMTVR,nt,A,30,true,"N-terminal ChaFRADIC",92,26010716,"MASCOT Score",25.2700000,,,,,0.00030779998633079,
AAGAKEMTVR,nt,A,30,true,"FtsH12 N-terminome: WT / FtsH12 knockdown miRNA",118,33216923,"MaxQuant score",103.7000000,,,,,5.2799998665208E-25,
AAGAKEMTVR,nt,A,30,true,"Mitochondrial intermediate peptidases - icp55 / WT",131a,25732537,,70.3300000,,-6.5216153,,,,
AAGAKEMTVR,nt,A,30,true,"Mitochondrial intermediate peptidases - oct1-1 / WT",131b,25732537,,68.3000000,,-0.4463802,,,,
AAGAKEMTVR,nt,A,30,true,"Mitochondrial intermediate peptidases - oct1-2 / WT",131c,25732537,,56.3800000,,-0.4835905,,,,
AAGAKEMTVR,nta,A,30,true,"Mitochondrial intermediate peptidases - oct1-1 / WT",131b,25732537,,71.5700000,,0.4387825,,,,
TRFALVSARSYAAGAKEMTVR,ub,K,34,true,"Arabidopsis ubiquitination by TUBEs",2,23667124,,,,,,,,
TRFALVSARSYAAGAKEMTVR,ub,K,34,true,"MudPIT plant ubiquitination",103,17272265,XCorr,2.3400000,,,,,,
GLLEKYGPER,ac,K,79,true,"Quantitative Acetylproteomics",101,29440448,,,,,,,,
AAIRDPDPVVFLE,nt,A,192,true,"Arg/N-end rule seed, prt6 vs. Wt",99,29168982,"MASCOT Score",32.7800000,,-0.2136597,0.5674135,NO,0.006004000082612,-3.6570525
SFPISEE,nt,S,212,true,"N-terminal ChaFRADIC",92,26010716,"MASCOT Score",32.5600000,,,,,0.11630000174046,
DVTIVTFSKMVGFALKAAEK,ub,K,247,true,"Arabidopsis ubiquitination by TUBEs",2,23667124,,,,,,,,
DVTIVTFSKMVGFALKAAEK,ub,K,247,true,"MudPIT plant ubiquitination",103,17272265,XCorr,2.6000000,,,,,,
DVTIVTFSKMVGFALKAAEK,ub,K,254,true,"Arabidopsis ubiquitination by TUBEs",2,23667124,,,,,,,,
ASVVEESFSYLDAPVER,nt,A,310,true,"Arg/N-end rule seed, prt6 vs. Wt",99,29168982,"MASCOT Score",55.8600000,,-1.2330859,0.1752760,NO,0.0080350004136562,-1.5060400
