Peptide,PTM,ModifiedAA,ModifiedPosition,PeptideUniqueToGene,ExperimentDesc,ExpID,PubmedID,ScoreType,IdentScore,LocProb,Log2FChange,PQ-val,QuantSig,PEP,MassErrorPPM
SLSFSGHSFQGR,ph,S,11,false,"srk2dei ABA signaling phopshoproteomics",83,23572148,"MASCOT Score",35.0000000,,,,,,0.0003000
SLSFSGHSFQGR,ph,S,11,false,"atm and atr DNA damage response",88,25561503,"MASCOT Score",56.0000000,0.9960000,,,,,0.4000000
SLSFSGHSFQGR,ph,S,11,false,"Tissue atlas Arabidopsis - ProteomicsDB",114,32188942,"MaxQuant score",316.1400000,0.9999970,,,,0,
KSLSFSGHSFQGR,ph,S,13,false,"MAPK Arabidopsis substrates",45,23172892,"MaxQuant Score",72.8910000,,,,,,
KSLSFSGHSFQGR,ph,S,13,false,"atm and atr DNA damage response",88,25561503,"MASCOT Score",46.0000000,0.9920000,,,,,-0.6500000
SLSFSGHSFQGR,ph,S,13,false,"Arabidopsis root NAA phosphoproteome",18a,27643528,"MaxQuant Score",68.0440000,0.9870000,,,,1.5330000678659E-5,-0.6020000
SLSFSGHSFQGR,ph,S,13,false,"STN8 phosphoproteome",38,21768351,"MASCOT Score",42.4200000,,,,,,-0.5309800
SLSFSGHSFQGR,ph,S,13,false,"MAPK Arabidopsis substrates",45,23172892,"MaxQuant Score",136.3800000,,,,,,
SLSFSGHSFQGR,ph,S,13,false,"Tyrosine phosphorylation in Arabidopsis",59,18463617,"MASCOT Score",40.0000000,,,,,,-1.2242673
SLSFSGHSFQGR,ph,S,13,false,"srk2dei ABA signaling phopshoproteomics",83,23572148,"MASCOT Score",78.0000000,,,,,,-0.0005000
SLSFSGHSFQGR,ph,S,13,false,"SnRK2 protein kinase substrates",85,23776212,XCorr,3.0162015,0.9370000,,,,0.0069348900578916,
SLSFSGHSFQGR,ph,S,13,false,"atm and atr DNA damage response",88,25561503,"MASCOT Score",58.0000000,1.0000000,,,,,-0.5100000
SLSFSGHSFQGR,ph,S,13,false,"Phospho cell culture sucrose/TOR",109,30833711,,,0.9999810,,,,,
SLSFSGHSFQGR,ph,S,13,false,"Tissue atlas Arabidopsis - ProteomicsDB",114,32188942,"MaxQuant score",262.1500000,0.9999990,,,,0,
SLSFSGHSFQGR,ph,S,15,false,"srk2dei ABA signaling phopshoproteomics",83,23572148,"MASCOT Score",20.0000000,,,,,,-0.0002000
SLSFSGHSFQGR,ph,S,15,false,"Tissue atlas Arabidopsis - ProteomicsDB",114,32188942,"MaxQuant score",220.4800000,0.9984330,,,,2.9976394580036E-39,
KSLSFSGHSFQGR,ph,S,18,false,"atm and atr DNA damage response",88,25561503,"MASCOT Score",25.0000000,0.9990000,,,,,-1.1900000
SLSFSGHSFQGR,ph,S,18,false,"STN8 phosphoproteome",38,21768351,"MASCOT Score",79.5900000,,,,,,-3.7382200
SLSFSGHSFQGR,ph,S,18,false,"MAPK Arabidopsis substrates",45,23172892,"MaxQuant Score",168.9800000,,,,,,
SLSFSGHSFQGR,ph,S,18,false,"Chloroplast kinase substrates",60,19376835,"MASCOT Score",71.2100000,,,,,,0.2168970
SLSFSGHSFQGR,ph,S,18,false,"srk2dei ABA signaling phopshoproteomics",83,23572148,"MASCOT Score",59.0000000,,,,,,-0.0002000
SLSFSGHSFQGR,ph,S,18,false,"atm and atr DNA damage response",88,25561503,"MASCOT Score",58.0000000,0.9930000,,,,,-0.5100000
SLSFSGHSFQGR,ph,S,18,false,"TOR Kinase and ABA Receptor",100,29290610,XCorr,2.9785910,0.9024000,,,,0.00070510001387447,
SLSFSGHSFQGR,ph,S,18,false,"Phospho cell culture sucrose/TOR",109,30833711,,,0.9999980,,,,,
SLSFSGHSFQGR,ph,S,18,false,"Tissue atlas Arabidopsis - ProteomicsDB",114,32188942,"MaxQuant score",301.4500000,1.0000000,,,,0,
KKASENEGGGGGGSDLLPR,ph,S,26,false,"Tissue atlas Arabidopsis - ProteomicsDB",114,32188942,"MaxQuant score",111.8200000,1.0000000,,,,1.146530023699E-10,
KASENEGGGGGGSDLLPR,ph,S,36,false,"Tissue atlas Arabidopsis - ProteomicsDB",114,32188942,"MaxQuant score",306.6200000,1.0000000,,,,0,
RSLTSSR,ph,S,43,false,"Tissue atlas Arabidopsis - ProteomicsDB",114,32188942,"MaxQuant score",91.6560000,0.9988360,,,,0.015883300453424,
SLTSSRSSISLSGER,ph,T,45,false,"atm and atr DNA damage response",88,25561503,"MASCOT Score",41.0000000,0.9910000,,,,,-0.4100000
SLTSSRSSISLSGER,ph,S,49,false,"atm and atr DNA damage response",88,25561503,"MASCOT Score",41.0000000,0.9660000,,,,,-0.4100000
SSISLSGER,ph,S,49,false,"Chloroplast kinase substrates",60,19376835,"MASCOT Score",35.5100000,,,,,,-0.5950120
SSISLSGER,ph,S,49,false,"atm and atr DNA damage response",88,25561503,"MASCOT Score",51.0000000,0.9480000,,,,,0.7100000
SSISLSGER,ph,S,49,false,"Protein sumoylation and phosphorylation cross-talk",97,28419593,,,,,,,,
SSISLSGER,ph,S,49,false,"Tissue atlas Arabidopsis - ProteomicsDB",114,32188942,"MaxQuant score",191.0500000,0.9967920,,,,2.6812699283063E-10,
SLTSSRSSISLSGER,ph,S,50,false,"atm and atr DNA damage response",88,25561503,"MASCOT Score",27.0000000,0.9880000,,,,,-0.1000000
SSISLSGER,ph,S,50,false,"srk2dei ABA signaling phopshoproteomics",83,23572148,"MASCOT Score",46.0000000,,,,,,0.0004000
SSISLSGER,ph,S,50,false,"atm and atr DNA damage response",88,25561503,"MASCOT Score",44.0000000,0.9920000,,,,,-0.0300000
SSISLSGER,ph,S,50,false,"Tissue atlas Arabidopsis - ProteomicsDB",114,32188942,"MaxQuant score",103.3100000,0.8049640,,,,0.00090540101518854,
RSLTSSRSSISLSGER,ph,S,52,false,"TOR Kinase and ABA Receptor",100,29290610,XCorr,2.6148562,0.9740000,,,,0.0049959998577833,
SLTSSRSSISLSGER,ph,S,52,false,"atm and atr DNA damage response",88,25561503,"MASCOT Score",28.0000000,1.0000000,,,,,-0.6000000
SSISLSGER,ph,S,52,false,"Tyrosine phosphorylation in Arabidopsis",59,18463617,"MASCOT Score",42.0000000,,,,,,-1.0843453
SSISLSGER,ph,S,52,false,"Chloroplast kinase substrates",60,19376835,"MASCOT Score",38.8500000,,,,,,0.2918160
SSISLSGER,ph,S,52,false,"SnRK2 protein kinase substrates",85,23776212,XCorr,2.1014371,0.9990000,,,,6.8691901105922E-5,
SSISLSGER,ph,S,52,false,"atm and atr DNA damage response",88,25561503,"MASCOT Score",48.0000000,0.9930000,,,,,-0.1300000
SSISLSGER,ph,S,52,false,"Lateral root-induction - NAA vs control",106,23328941,"MASCOT Score",21.0000000,,,,,,
SSISLSGER,ph,S,52,false,"Tissue atlas Arabidopsis - ProteomicsDB",114,32188942,"MaxQuant score",162.0000000,0.9999960,,,,7.6463300501928E-5,
SSISLSGER,ph,S,54,false,"Tissue atlas Arabidopsis - ProteomicsDB",114,32188942,"MaxQuant score",136.5000000,0.9990240,,,,9.8532196716405E-5,
ALTVPDSTTLFEACR,sno,C,84,false,"hot5-4 / wildtype, FAT-switch S-nitrosoproteome",169,37277371,,,,,,,,
NWGTSIAGPNTFMETLR,ph,S,210,false,"Tissue atlas Arabidopsis - ProteomicsDB",114,32188942,"MaxQuant score",195.4600000,0.9986790,,,,8.9064288314942E-40,
MVEYQSSAAMVMVENK,ph,Y,259,false,"Brassinosteroid-Regulated Phosphorylation Dynamics",94,26187819,"MaxQuant Score",57.3660000,0.8540000,,,,0.041999999433756,-0.8210000
FWDSAMALSPNEDGDETR,ph,S,381,false,"Tissue atlas Arabidopsis - ProteomicsDB",114,32188942,"MaxQuant score",197.7200000,1.0000000,,,,1.4012984643248E-45,
FWDSAMALSPNEDGDETRSEEESMK,ph,T,389,false,"Large-scale phosphorylation discovery",44,23111157,XCorr,4.4540000,,,,,,
FWDSAMALSPNEDGDETRSEEESMK,ph,T,389,false,"TOR Kinase and ABA Receptor",100,29290610,XCorr,4.4021592,0.8633000,,,,4.755999907502E-5,
FWDSAMALSPNEDGDETRSEEESMK,ph,S,391,false,"Large-scale phosphorylation discovery",44,23111157,XCorr,3.9940000,,,,,,
FWDSAMALSPNEDGDETRSEEESMK,ph,S,391,false,"TOR Kinase and ABA Receptor",100,29290610,XCorr,4.5637245,0.9407000,,,,5.4830001317896E-5,
FWDSAMALSPNEDGDETRSEEESMK,ph,S,391,false,"Tissue atlas Arabidopsis - ProteomicsDB",114,32188942,"MaxQuant score",196.0100000,0.9484540,,,,0,
FWDSAMALSPNEDGDETRSEEESMK,ph,S,395,false,"TOR Kinase and ABA Receptor",100,29290610,XCorr,4.4021592,0.9765000,,,,4.755999907502E-5,
LSSEIEVTK,ph,S,400,false,"LAXIC - ABA stress",84a,23660473,XCorr,2.2500000,0.9950000,,,,0.0032964900601655,
LSSEIEVTK,ph,S,400,false,"atm and atr DNA damage response",88,25561503,"MASCOT Score",39.0000000,0.9970000,,,,,0.4100000
LSSEIEVTK,ph,S,400,false,"TOR Kinase and ABA Receptor",100,29290610,XCorr,3.2085960,0.9218000,,,,0.0004956999910064,
LSSEIEVTK,ph,S,400,false,"Tissue atlas Arabidopsis - ProteomicsDB",114,32188942,"MaxQuant score",123.6200000,0.9997200,,,,0.00023132099886425,
SFSYPNTFAFK,ph,S,407,false,"Tyrosine phosphorylation in Arabidopsis",59,18463617,"MASCOT Score",21.0000000,,,,,,-0.2162030
SFSYPNTFAFK,ph,S,407,false,"srk2dei ABA signaling phopshoproteomics",83,23572148,"MASCOT Score",21.0000000,,,,,,0.0008000
SFSYPNTFAFK,ph,S,407,false,"atm and atr DNA damage response",88,25561503,"MASCOT Score",43.0000000,1.0000000,,,,,0.1600000
SFSYPNTFAFK,ph,S,407,false,"TOR Kinase and ABA Receptor",100,29290610,XCorr,2.8862777,0.9996000,,,,0.016359999775887,
SFSYPNTFAFK,ph,S,407,false,"Tissue atlas Arabidopsis - ProteomicsDB",114,32188942,"MaxQuant score",214.0400000,0.9998360,,,,3.4830899723798E-32,
GLSSEDMDYDQSNSWAAAYK,ph,S,508,false,"Tissue atlas Arabidopsis - ProteomicsDB",114,32188942,"MaxQuant score",398.9200000,0.9978890,,,,0,
