Peptide,PTM,ModifiedAA,ModifiedPosition,PeptideUniqueToGene,ExperimentDesc,ExpID,PubmedID,ScoreType,IdentScore,LocProb,Log2FChange,PQ-val,QuantSig,PEP,MassErrorPPM
ATSSAASVDMEDIQTVDLMSELLR,nta,A,2,true,"Characterization plant N-terminal acetylation",6,22223895,"MASCOT Score",60.8700000,,,,,,
ATSSAASVDMEDIQTVDLMSELLR,nta,A,2,true,"Arabidopsis translation initiation landscape - NTA",167a,35069635,,,,,,,,
CASKPDK,sno,C,29,true,"hot5-4 / wildtype, FAT-switch S-nitrosoproteome",169,37277371,,,,0.4506147,0.0038741,NO,,
TPLGVKAK,ac,K,82,false,"Quantitative Acetylproteomics",101,29440448,,,,,,,,
TVTQAEKLDEMLNRR,ub,K,129,true,"Arabidopsis ubiquitination COFRADIC",40,26744219,"MaxQuant Score",203.2700000,1.0000000,,,,0,0.4700000
GAQIDKVLNFAIDDSVLEER,ub,K,143,true,"Arabidopsis ubiquitination COFRADIC",40,26744219,"MaxQuant Score",69.7650000,1.0000000,,,,7.6799997562792E-18,1.0620000
SYHTKFAPPKVPGVDDLTGEPLIQR,nt,S,170,true,"Arabidopsis translation initiation landscape - NT",167b,35069635,,,,,,,,
SYHTKFAPPK,ac,K,174,false,"Quantitative Acetylproteomics",101,29440448,,,,,,,,
KDDNADVLR,ub,K,195,true,"Arabidopsis ubiquitination COFRADIC",40,26744219,"MaxQuant Score",125.7500000,1.0000000,,,,0.0010000000474975,0.0890000
