Peptide,PTM,ModifiedAA,ModifiedPosition,PeptideUniqueToGene,ExperimentDesc,ExpID,PubmedID,ScoreType,IdentScore,LocProb,Log2FChange,PQ-val,QuantSig,PEP,MassErrorPPM
IQGTSTDPVITPLKNR,nt,I,50,true,"Arg/N-end rule pathway Roots",80,25728785,"MASCOT Score",24.7300000,,,,,0.036789998412132,
IQGTSTDPVITPLKNR,nt,I,50,true,"N-terminal ChaFRADIC",92,26010716,"MASCOT Score",40.0600000,,,,,3.2600000849925E-5,
IQGTSTDPVITPLKNR,nt,I,50,true,"Mitochondrial intermediate peptidases - icp55 / WT",131a,25732537,,98.5700000,,0.0326197,,,,
IQGTSTDPVITPLKNR,nt,I,50,true,"Mitochondrial intermediate peptidases - oct1-1 / WT",131b,25732537,,88.0300000,,-0.3240368,,,,
IQGTSTDPVITPLKNR,nt,I,50,true,"Mitochondrial intermediate peptidases - oct1-2 / WT",131c,25732537,,77.5400000,,-0.3500965,,,,
IQGTSTDPVITPLKN,nt,I,50,true,"HUNTER N-terminome: legumain, GluC and trypsin",119,31951383,"MaxQuant score",123.6400000,,,,,,
IQGTSTDPVITPLKNR,nta,I,50,true,"N-terminal ChaFRADIC",92,26010716,"MASCOT Score",40.0600000,,,,,3.2600000849925E-5,
IQGTSTDPVITPLKNR,nta,I,50,true,"HUNTER N-terminome: legumain, GluC and trypsin",119,31951383,"MaxQuant score",53.2520000,,,,,,
IQGTSTDPVITPLK,nta,I,50,true,"Characterization plant N-terminal acetylation",6,22223895,"MASCOT Score",46.5600000,,,,,,
