Peptide,PTM,ModifiedAA,ModifiedPosition,PeptideUniqueToGene,ExperimentDesc,ExpID,PubmedID,ScoreType,IdentScore,LocProb,Log2FChange,PQ-val,QuantSig,PEP,MassErrorPPM
MKEGKDGFVR,nta,M,1,true,"N-term acetylation drought responses",5,26184543,,,,,,,,
MKEGKDGFVR,nta,M,1,true,"Arabidopsis translation initiation landscape - NTA",167a,35069635,,,,,,,,
SLDEQLER,ph,S,18,true,"Tissue atlas Arabidopsis - ProteomicsDB",114,32188942,"MaxQuant score",114.9700000,1.0000000,,,,0.0032949699088931,
ALTLEKNK,ph,T,32,true,"Ethylene-regulated phosphorylation ein2 mutant",30,19253305,"MASCOT Score",46.6667000,,,,,,-0.0613107
ALTLEK,ph,T,32,false,"srk2dei ABA signaling phopshoproteomics",83,23572148,"MASCOT Score",34.0000000,,,,,,-0.0002000
ALTLEK,ph,T,32,false,"SnRK2 protein kinase substrates",85,23776212,XCorr,2.3295858,1.0000000,,,,0.19464200735092,
ALTLEK,ph,T,32,false,"TOR Kinase and ABA Receptor",100,29290610,XCorr,2.6361542,1.0000000,,,,0.0077860001474619,
KKDEEDTTAVAIGGSASSSPVTLNGGGFVGK,ph,S,52,true,"Phosphorylation Early Elicitor Signaling",23,17317660,,,,,,,,
KKDEEDTTAVAIGGSASSSPVTLNGGGFVGK,ph,S,52,true,"Large-scale phosphorylation discovery",44,23111157,XCorr,5.1320000,,,,,,
KKDEEDTTAVAIGGSASSSPVTLNGGGFVGK,ph,S,52,true,"Tissue atlas Arabidopsis - ProteomicsDB",114,32188942,"MaxQuant score",212.4400000,0.9998440,,,,0,
KDEEDTTAVAIGGSASSSPVTLNGGGFVGK,ph,S,52,true,"Large-scale phosphorylation discovery",44,23111157,XCorr,4.7620000,,,,,,
KKDEEDTTAVAIGGSASSSPVTLNGGGFVGK,ph,S,56,true,"Phosphorylation Early Elicitor Signaling",23,17317660,,,,,,,,
KKDEEDTTAVAIGGSASSSPVTLNGGGFVGK,ph,S,56,true,"Large-scale phosphorylation discovery",44,23111157,XCorr,5.6140000,,,,,,
KKDEEDTTAVAIGGSASSSPVTLNGGGFVGK,ph,S,56,true,"Tissue atlas Arabidopsis - ProteomicsDB",114,32188942,"MaxQuant score",212.4400000,0.9798450,,,,0,
LEWEIDPSK,ph,S,80,true,"SIRK1 phosphorylation",86a,23820729,"MaxQuant Score",50.7170000,1.0000000,,,,1.0770000219345,9.0480000
LEWEIDPSK,ph,S,80,true,"SIRK1 exp - sirk1 mutant vs WT",86b,23820729,,,,-1.2519564,,NO,,
LIIKTVLAR,ub,K,85,true,"upl3 mutant / wildtype",168,35926874,"MaxQuant score",58.4330000,1.0000000,,,,0.018042299896479,0.8140800
LLDWGEEGHRSEAEIVSLR,ph,S,120,true,"TOR Kinase and ABA Receptor",100,29290610,XCorr,3.0761571,1.0000000,,,,0.00087129999883473,
SEAEIVSLR,ph,S,120,true,"Tissue atlas Arabidopsis - ProteomicsDB",114,32188942,"MaxQuant score",198.5500000,1.0000000,,,,0,
SYLIKNR,ac,K,193,true,"Quantitative Acetylproteomics",101,29440448,,,,,,,,
DVKTENMLLDK,ac,K,229,false,"Quantitative Acetylproteomics",101,29440448,,,,,,,,
GGGMIPNDQQQGCLCFRR,acy,C,376,true,"Arabidopsis S-acylation atlas - Silique",163e,35681017,,,,,,,,
GGGMIPNDQQQGCLCFR,acy,C,376,true,"Arabidopsis S-acylation atlas - Hypocotyl",163b,35681017,,,,,,,,
GGGMIPNDQQQGCLCFR,acy,C,376,true,"Arabidopsis S-acylation atlas - Leaf",163c,35681017,,,,,,,,
GGGMIPNDQQQGCLCFR,acy,C,376,true,"Arabidopsis S-acylation atlas - Seedling",163d,35681017,,,,,,,,
GGGMIPNDQQQGCLCFR,acy,C,376,true,"Arabidopsis S-acylation atlas - Silique",163e,35681017,,,,,,,,
GGGMIPNDQQQGCLCFR,acy,C,376,true,"Arabidopsis S-acylation atlas - Stem",163f,35681017,,,,,,,,
GGGMIPNDQQQGCLCFRR,acy,C,378,true,"Arabidopsis S-acylation atlas - Silique",163e,35681017,,,,,,,,
GGGMIPNDQQQGCLCFR,acy,C,378,true,"Arabidopsis S-acylation atlas - Hypocotyl",163b,35681017,,,,,,,,
GGGMIPNDQQQGCLCFR,acy,C,378,true,"Arabidopsis S-acylation atlas - Leaf",163c,35681017,,,,,,,,
GGGMIPNDQQQGCLCFR,acy,C,378,true,"Arabidopsis S-acylation atlas - Seedling",163d,35681017,,,,,,,,
GGGMIPNDQQQGCLCFR,acy,C,378,true,"Arabidopsis S-acylation atlas - Silique",163e,35681017,,,,,,,,
GGGMIPNDQQQGCLCFR,acy,C,378,true,"Arabidopsis S-acylation atlas - Stem",163f,35681017,,,,,,,,
