Peptide,PTM,ModifiedAA,ModifiedPosition,PeptideUniqueToGene,ExperimentDesc,ExpID,PubmedID,ScoreType,IdentScore,LocProb,Log2FChange,PQ-val,QuantSig,PEP,MassErrorPPM
VKVRMNTADVAAEVKCL,nt,V,2,true,"Arabidopsis translation initiation landscape - NT",167b,35069635,,,,,,,,
TLGLGAATVAGK,ph,T,771,true,"Tissue atlas Arabidopsis - ProteomicsDB",114,32188942,"MaxQuant score",90.7590000,1.0000000,,,,0.0010252100182697,
MGQSGNTAADGNTGQEK,ph,S,818,true,"Tissue atlas Arabidopsis - ProteomicsDB",114,32188942,"MaxQuant score",119.3000000,0.9999180,,,,6.6792998909548E-10,
EKDVSSLSQATK,ph,S,841,true,"Tissue atlas Arabidopsis - ProteomicsDB",114,32188942,"MaxQuant score",106.2900000,0.8333150,,,,0.00015583500498906,
EKDVSSLSQATK,ph,S,843,true,"Tissue atlas Arabidopsis - ProteomicsDB",114,32188942,"MaxQuant score",88.7800000,0.8223640,,,,0.00086397200357169,
DVSSLSQATKSIPDNKPAGEK,ub,K,847,true,"Arabidopsis ubiquitination by TUBEs",2,23667124,,,,,,,,
DVSSLSQATKSIPDNKPAGEK,ub,K,847,true,"Protein ubiquitination during photomorphogenesis",3,28461270,,,,,,,,
SIPDNKPAGEK,ph,S,848,true,"Tissue atlas Arabidopsis - ProteomicsDB",114,32188942,"MaxQuant score",108.3200000,1.0000000,,,,6.6017302742694E-5,
KMKEKYADQDEDER,nt,K,869,true,"Metacaspase9 substrates - in vitro rMC9",51c,23964026,"MASCOT Score",73.0000000,,5.3347731,,NO,,-1.0973162
MALLASSGKPQK,ph,S,891,true,"Tissue atlas Arabidopsis - ProteomicsDB",114,32188942,"MaxQuant score",124.0700000,0.9134900,,,,6.5434600401204E-5,
MALLASSGKPQK,ph,S,892,true,"Tissue atlas Arabidopsis - ProteomicsDB",114,32188942,"MaxQuant score",126.1000000,0.9587230,,,,6.7626700911205E-5,
ACTDPELMAALVGNVK,so,C,1041,true,"S-sulfenylation site detection using YAP1C",110,32714340,,,,,,,,
