Peptide,PTM,ModifiedAA,ModifiedPosition,PeptideUniqueToGene,ExperimentDesc,ExpID,PubmedID,ScoreType,IdentScore,LocProb,Log2FChange,PQ-val,QuantSig,PEP,MassErrorPPM
ASSAAQIHILGGIGFPTSSSSSSTK,ph,T,18,true,"Brassinosteroid-Regulated Phosphorylation Dynamics",94,26187819,"MaxQuant Score",40.0120000,0.9290000,,,,0.037000000476837,2.3320000
VVNEKVVGIDLGTTNSAVAAMEGGKPTIVTNAEGQR,nt,V,75,false,"Stromal N-terminome",96,26371235,"MASCOT Score",105.2500000,,,,,,
VVNEKVVGIDLGTTN,nt,V,75,false,"Arg/N-end rule seed, prt6 vs. Wt",99,29168982,"MASCOT Score",29.5800000,,0.9694437,0.0644051,NO,0.074089996516705,-1.3205020
EKVVGIDLGTTNSAVAAMEGGKPTIVTNAEGQR,nt,E,78,false,"Arg/N-end rule pathway Roots",80,25728785,"MASCOT Score",94.8700000,,,,,1.819999984054E-10,
EKVVGIDLGTTNSAVAAMEGGKPTIVTNAEGQR,nt,E,78,false,"Stromal N-terminome",96,26371235,"MASCOT Score",82.3600000,,,,,,
EKVVGIDLGTTNSAVAAMEGGKPTIVTNAEGQR,nt,E,78,false,"HUNTER N-terminome: legumain, GluC and trypsin",119,31951383,"MaxQuant score",266.0100000,,,,,,
EKVVGIDLGTTNSAVAAME,nt,E,78,false,"Stromal N-terminome",96,26371235,"MASCOT Score",41.5200000,,,,,,
EKVVGIDLGTTNSAVAAME,nt,E,78,false,"HUNTER N-terminome: legumain, GluC and trypsin",119,31951383,"MaxQuant score",269.8500000,,,,,,
EKVVGIDLGTTN,nt,E,78,false,"HUNTER N-terminome: legumain, GluC and trypsin",119,31951383,"MaxQuant score",196.2700000,,,,,,
EKVVGIDLGTTNSAVAAMEGGKPTIVTNAEGQR,nta,E,78,false,"FtsH12 N-terminome: WT / FtsH12 knockdown miRNA",118,33216923,"MaxQuant score",72.6520000,,,,,0.014615000225604,
LVGQIAKR,ac,K,131,false,"Quantitative Acetylproteomics",101,29440448,,,,,,,,
LVGQIAKR,ub,K,131,false,"Arabidopsis ubiquitination COFRADIC",40,26744219,"MaxQuant Score",89.2960000,1.0000000,,,,0.013000000268221,0.0570000
QAVVNPENTFFSVKR,nt,Q,133,false,"HUNTER N-terminome: legumain, GluC and trypsin",119,31951383,"MaxQuant score",77.1240000,,,,,,
QAVVNPENTFFSVKR,ac,K,146,false,"Histone deacetylases - apicidin vs control",98a,29061669,"MaxQuant Score",94.5000000,1.0000000,0.5930000,0.1069055,NO,1.399999973728E-6,
QAVVNPENTFFSVKR,ac,K,146,false,"Quantitative Acetylproteomics",101,29440448,,,,,,,,
QAVVNPENTFFSVKR,ub,K,146,false,"Arabidopsis ubiquitination COFRADIC",40,26744219,"MaxQuant Score",55.6600000,1.0000000,,,,8.5250001575332E-5,-0.4950000
MNEVAEESKQVSYR,ub,K,161,true,"Arabidopsis ubiquitination COFRADIC",40,26744219,"MaxQuant Score",137.8000000,1.0000000,,,,3.5069999048631E-20,-0.4130000
VIKDENGNVK,ac,K,169,true,"Quantitative Acetylproteomics",101,29440448,,,,,,,,
LDCPAIGK,ox,C,179,true,"OxiTRAQ Arabidopsis - 5 mM H2O2 versus control",47,24376095,,,,-0.1172481,0.5518703,NO,,
LDCPAIGK,sno,C,179,true,"hot5-4 / wildtype, FAT-switch S-nitrosoproteome",169,37277371,,,,0.9414435,0.0003480,YES,,
VIKDENGNVKLDCPAIGK,so,C,179,true,"S-sulfenylation site detection using YAP1C",110,32714340,,,,,,,,
QFAAEEISAQVLR,nt,Q,185,false,"Metacaspase9 substrates - in vitro rMC9",51c,23964026,"MASCOT Score",47.0000000,,4.4285779,,NO,,-0.6532510
KLVDDASR,ub,K,198,false,"Arabidopsis ubiquitination COFRADIC",40,26744219,"MaxQuant Score",117.8100000,1.0000000,,,,0.0040000001899898,-0.0770000
FLNDKVTK,ac,K,210,false,"Histone deacetylases - apicidin vs control",98a,29061669,"MaxQuant Score",93.7000000,1.0000000,0.3330000,0.3556313,NO,0.017000000923872,
FLNDKVTKAVITVPAYFNDSQR,ac,K,213,false,"Quantitative Acetylproteomics",101,29440448,,,,,,,,
STSGDTHLGGDDFDKR,nt,S,291,false,"Arg/N-end rule seed, prt6 vs. Wt",99,29168982,"MASCOT Score",27.2400000,,-0.1945164,0.4698458,NO,0.095909997820854,-0.3006690
STSGDTHLGGDDFDKR,nta,S,291,false,"FtsH12 N-terminome: WT / FtsH12 knockdown miRNA",118,33216923,"MaxQuant score",157.8600000,,,,,1.1999999605106E-10,
KDEGIDLLKDK,ac,K,325,false,"Quantitative Acetylproteomics",101,29440448,,,,,,,,
DEGIDLLKDK,ac,K,325,false,"Histone deacetylases - apicidin vs control",98a,29061669,"MaxQuant Score",114.8000000,1.0000000,0.4920000,0.1573983,NO,0.003000000026077,
DEGIDLLKDK,ac,K,325,false,"Histone deacetylases substrates - hda14 vs WT",98e,29061669,"MaxQuant Score",124.4000000,1.0000000,-0.3920000,0.8472274,NO,7.5999996226872E-12,
LTEAAEKAK,ac,K,339,false,"Quantitative Acetylproteomics",101,29440448,,,,,,,,
GKFEELCSDLLDR,nt,G,374,true,"Metacaspase9 substrates - in vitro rMC9",51c,23964026,"MASCOT Score",86.0000000,,3.0985451,,NO,,-0.7554470
GKFEELCSDLLDR,ac,K,375,true,"Histone deacetylases substrates - hda14 vs WT",98e,29061669,"MaxQuant Score",95.6000000,1.0000000,0.0700000,0.9120108,NO,4.8999999613386E-9,
FEELCSDLLDR,acy,C,380,false,"Arabidopsis S-acylation atlas - Meristem",163a,35681017,,,,,,,,
FEELCSDLLDR,acy,C,380,false,"Arabidopsis S-acylation atlas - Hypocotyl",163b,35681017,,,,,,,,
GKFEELCSDLLDR,sno,C,380,true,"Site-specific nitrosomeproteomic id - gsnor1-3",90a,25699590,XCorr,4.0751991,,,,,4.63100008119E-7,-6.0666771
GKFEELCSDLLDR,sno,C,380,true,"Site-specific nitrosomeproteomic id - gsnor1-3",90b,25699590,XCorr,4.2803721,,,,,0.019990000873804,-7.1787041
FEELCSDLLDR,sno,C,380,false,"Site-specific nitrosomeproteomic id - gsnor1-3",90a,25699590,XCorr,3.5197735,,,,,6.0170001233928E-5,-6.9067076
GKFEELCSDLLDR,so,C,380,true,"S-sulfenylation site detection using YAP1C",110,32714340,,,,,,,,
VRTPVENSLR,ph,T,389,false,"atm and atr DNA damage response",88,25561503,"MASCOT Score",39.0000000,1.0000000,,,,,-0.3100000
VRTPVENSLR,ph,T,389,false,"Tissue atlas Arabidopsis - ProteomicsDB",114,32188942,"MaxQuant score",128.9500000,1.0000000,,,,2.1019899577368E-5,
LSFKDIDEVILVGGSTR,ph,S,401,false,"Large-scale phosphorylation discovery",44,23111157,XCorr,4.1450000,,,,,,
VTPLSLGLE,nt,V,465,false,"Arg/N-end rule seed, prt6 vs. Wt",99,29168982,"MASCOT Score",54.9000000,,,,,0.00014010000450071,1.6613980
DNKSIGSFR,ac,K,523,true,"Quantitative Acetylproteomics",101,29440448,,,,,,,,
SIGSFR,ph,S,527,false,"srk2dei ABA signaling phopshoproteomics",83,23572148,"MASCOT Score",31.0000000,,,,,,0.0001000
LDGIPPAPRGVPQIEVK,me1,R,538,false,"Arabidopsis protein methylome",123,31809900,"MaxQuant Score",57.1480000,1.0000000,,,,6.8085801103734E-6,-0.0717820
DAIDTKNQADSVVYQTEK,hib,K,607,false,"Open search Plant PTM Viewer 2.0 - hib",164e,TBA,,,,,,,,
NQADSVVYQTEK,ph,S,612,false,"atm and atr DNA damage response",88,25561503,"MASCOT Score",36.0000000,1.0000000,,,,,-1.2000000
NQADSVVYQTEK,ph,S,612,false,"Tissue atlas Arabidopsis - ProteomicsDB",114,32188942,"MaxQuant score",175.3100000,1.0000000,,,,3.2771600967733E-15,
NQADSVVYQTEK,ph,T,617,false,"Tyrosine phosphorylation - flg22 vs mock",105,22074104,"MASCOT Score",60.3100000,,,,,,0.6250777
NQADSVVYQTEKQLK,ac,K,619,false,"Histone deacetylases - apicidin vs control",98a,29061669,"MaxQuant Score",112.6000000,1.0000000,0.4800000,0.2558586,NO,2.8000000525086E-14,
NQADSVVYQTEKQLK,ac,K,619,false,"Histone deacetylases substrates - TSA vs control",98b,29061669,"MaxQuant Score",112.6000000,1.0000000,0.2040000,0.9794900,NO,2.8000000525086E-14,
NQADSVVYQTEKQLK,ac,K,619,false,"Histone deacetylases substrates - hda14 vs WT",98e,29061669,"MaxQuant Score",97.8000000,1.0000000,0.1820000,0.7870458,NO,1.3000000381735E-11,
ELGEKIPGPVK,ac,K,627,true,"Histone deacetylases substrates - hda14 vs WT",98e,29061669,"MaxQuant Score",66.3000000,1.0000000,1.7200000,0.1101539,NO,0.0020000000949949,
LQELKEK,ac,K,644,false,"Quantitative Acetylproteomics",101,29440448,,,,,,,,
QSLYNQPQPGGADSPPGGE,nt,Q,671,true,"HUNTER N-terminome: legumain, GluC and trypsin",119,31951383,"MaxQuant score",98.5820000,,,,,,
QPQPGGADSPPGGEASSSSDTSSSAKGGDN,nt,Q,676,true,"HUNTER N-terminome: legumain, GluC and trypsin",119,31951383,"MaxQuant score",48.7380000,,,,,,
GGDNGGDVIDADFTDSN,ph,T,715,true,"Phosphoproteomic analysis of seed maturation",42,22440515,"MASCOT Score",40.0000000,,,,,,-1.2900000
GGDNGGDVIDADFTDSN,ph,T,715,true,"srk2dei ABA signaling phopshoproteomics",83,23572148,"MASCOT Score",69.0000000,,,,,,0.0019000
GGDNGGDVIDADFTDSN,ph,T,715,true,"LAXIC - ABA stress",84a,23660473,XCorr,4.1700000,0.9860000,,,,1.0699999620556E-5,
GGDNGGDVIDADFTDSN,ph,T,715,true,"LAXIC - mannitol vs control",84b,23660473,XCorr,4.7100000,1.0000000,,,,4.4799999484885E-14,
GGDNGGDVIDADFTDSN,ph,T,715,true,"SnRK2 protein kinase substrates",85,23776212,XCorr,4.3397393,1.0000000,,,,3.96250006599E-16,
GGDNGGDVIDADFTDSN,ph,T,715,true,"atm and atr DNA damage response",88,25561503,"MASCOT Score",89.0000000,1.0000000,,,,,-0.4900000
GGDNGGDVIDADFTDSN,ph,T,715,true,"TOR Kinase and ABA Receptor",100,29290610,XCorr,4.1747856,0.9924000,,,,6.0679999478452E-6,
GGDNGGDVIDADFTDSN,ph,T,715,true,"Lateral root-induction - NAA vs control",106,23328941,"MASCOT Score",40.0000000,,,,,,
GGDNGGDVIDADFTDSN,ph,T,715,true,"Tissue atlas Arabidopsis - ProteomicsDB",114,32188942,"MaxQuant score",303.0700000,0.9983080,,,,0,
GGDNGGDVIDADFTDSN,ph,S,717,true,"atm and atr DNA damage response",88,25561503,"MASCOT Score",90.0000000,0.9580000,,,,,-0.0400000
