Peptide,PTM,ModifiedAA,ModifiedPosition,PeptideUniqueToGene,ExperimentDesc,ExpID,PubmedID,ScoreType,IdentScore,LocProb,Log2FChange,PQ-val,QuantSig,PEP,MassErrorPPM
LTNGLDASALNALKSE,nt,L,24,true,"HUNTER N-terminome: legumain, GluC and trypsin",119,31951383,"MaxQuant score",94.7280000,,,,,,
LYWFDIADNQIEGELPVSNGTSAPGLDMLLQTK,ng,N,182,true,"Conserved N-glycosylation",74,22633491,"MaxQuant Score",163.4700000,1.0000000,,,,1.7880000086556E-33,-0.2710000
SPSFSGLFNSTNFSILQK,ng,N,456,true,"UDP-GlcNAc transporter glycopeptide analysis",135,30224661,,,,,,,3.3940144907385E-18,0.4000000
SPSFSGLFNSTNFSILQK,ng,N,459,true,"UDP-GlcNAc transporter glycopeptide analysis",135,30224661,,,,,,,1.0652267286429E-15,0.7000000
WDTSKSSIDAPQLMGAK,ph,T,603,true,"Tissue atlas Arabidopsis - ProteomicsDB",114,32188942,"MaxQuant score",121.0100000,0.9888550,,,,1.1926600151924E-8,
WDTSKSSIDAPQLMGAK,ph,S,604,true,"Tissue atlas Arabidopsis - ProteomicsDB",114,32188942,"MaxQuant score",183.3600000,0.9713890,,,,1.4154999789099E-29,
WDTSKSSIDAPQLMGAK,ub,K,605,true,"Ubiquitination Membrane Proteins",120,33585938,,,,,,,,
WDTSKSSIDAPQLMGAK,ph,S,606,true,"Phosphorylation Early Elicitor Signaling",23,17317660,,,,,,,,
WDTSKSSIDAPQLMGAK,ph,S,606,true,"TOR Kinase and ABA Receptor",100,29290610,XCorr,3.0301476,0.9692000,,,,0.013399999588728,
WDTSKSSIDAPQLMGAK,ph,S,606,true,"Tissue atlas Arabidopsis - ProteomicsDB",114,32188942,"MaxQuant score",263.2200000,0.9950090,,,,0,
WDTSKSSIDAPQLMGAK,ph,S,607,true,"TOR Kinase and ABA Receptor",100,29290610,XCorr,3.0301476,0.9989000,,,,0.013399999588728,
WDTSKSSIDAPQLMGAK,ph,S,607,true,"Tissue atlas Arabidopsis - ProteomicsDB",114,32188942,"MaxQuant score",235.2600000,0.9842790,,,,0,
SSIDAPQLMGAK,ph,S,607,true,"atm and atr DNA damage response",88,25561503,"MASCOT Score",41.0000000,1.0000000,,,,,-0.6200000
AFTFEELKK,ub,K,625,true,"Ubiquitination Membrane Proteins",120,33585938,,,,,,,,
AFTFEELKK,ub,K,625,true,"upl3 mutant / wildtype",168,35926874,"MaxQuant score",54.9820000,1.0000000,-1.0086822,,,0.0077415001578629,-1.2630000
KCTDNFSEANDVGGGGYGK,ub,K,626,true,"upl3 mutant / wildtype",168,35926874,"MaxQuant score",96.1530000,1.0000000,-0.1648844,0.6595600,NO,1.0839700337328E-7,-0.1814700
GILPNGQLIAIKR,ac,K,659,true,"Quantitative Acetylproteomics",101,29440448,,,,,,,,
DSLSGKSGIR,ac,K,719,false,"Quantitative Acetylproteomics",101,29440448,,,,,,,,
LVGDPEKTHVTTQVK,ph,T,786,true,"Tissue atlas Arabidopsis - ProteomicsDB",114,32188942,"MaxQuant score",91.6400000,0.9774640,,,,3.6811099562328E-5,
LVGDPEKTHVTTQVK,ph,T,789,true,"Tissue atlas Arabidopsis - ProteomicsDB",114,32188942,"MaxQuant score",67.4180000,0.9152630,,,,0.00035899601061828,
THVTTQVK,ph,T,789,true,"atm and atr DNA damage response",88,25561503,"MASCOT Score",27.0000000,1.0000000,,,,,-1.2200000
THVTTQVK,ph,T,790,true,"atm and atr DNA damage response",88,25561503,"MASCOT Score",27.0000000,1.0000000,,,,,-1.2200000
SRSLYDLQELLDTTIIASSGNLK,ph,S,849,true,"Large-scale phosphorylation discovery",44,23111157,XCorr,4.5220000,,,,,,
SLYDLQELLDTTIIASSGNLKGFEK,ph,S,866,true,"Large-scale phosphorylation discovery",44,23111157,XCorr,5.1750000,,,,,,
SLYDLQELLDTTIIASSGNLK,ph,S,866,true,"Large-scale phosphorylation discovery",44,23111157,XCorr,3.4810000,,,,,,
SLYDLQELLDTTIIASSGNLK,ph,S,866,true,"SnRK2 protein kinase substrates",85,23776212,XCorr,2.5729530,0.9740000,,,,0.020082099363208,
SLYDLQELLDTTIIASSGNLK,ph,S,866,true,"Protein sumoylation and phosphorylation cross-talk",97,28419593,,,,,,,,
SLYDLQELLDTTIIASSGNLK,ph,S,866,true,"Tissue atlas Arabidopsis - ProteomicsDB",114,32188942,"MaxQuant score",308.1000000,0.9129120,,,,0,
SLYDLQELLDTTIIASSGNLK,ph,S,867,true,"Large-scale phosphorylation discovery",44,23111157,XCorr,4.6440000,,,,,,
EIENIMQLAGLNPNSDSATSSR,ph,S,914,true,"Large-scale phosphorylation discovery",44,23111157,XCorr,4.8860000,,,,,,
EIENIMQLAGLNPNSDSATSSR,ph,S,914,true,"srk2dei ABA signaling phopshoproteomics",83,23572148,"MASCOT Score",48.0000000,,,,,,-0.0022000
EIENIMQLAGLNPNSDSATSSR,ph,S,914,true,"Lateral root-induction - NAA vs control",106,23328941,"MASCOT Score",56.0000000,,,,,,
EIENIMQLAGLNPNSDSATSSRTYEDAIK,ph,S,916,true,"TOR Kinase and ABA Receptor",100,29290610,XCorr,5.2126231,0.8784000,,,,1.6489999325131E-5,
EIENIMQLAGLNPNSDSATSSR,ph,S,916,true,"Large-scale phosphorylation discovery",44,23111157,XCorr,6.2390000,,,,,,
EIENIMQLAGLNPNSDSATSSR,ph,S,916,true,"SnRK2 protein kinase substrates",85,23776212,XCorr,3.8943710,0.9920000,,,,0.00098501599859446,
EIENIMQLAGLNPNSDSATSSR,ph,S,916,true,"atm and atr DNA damage response",88,25561503,"MASCOT Score",46.0000000,0.8990000,,,,,-0.2700000
EIENIMQLAGLNPNSDSATSSR,ph,S,916,true,"TOR Kinase and ABA Receptor",100,29290610,XCorr,6.6137257,0.9266000,,,,1.2480000366466E-9,
EIENIMQLAGLNPNSDSATSSR,ph,S,916,true,"Lateral root-induction - NAA vs control",106,23328941,"MASCOT Score",45.0000000,,,,,,
EIENIMQLAGLNPNSDSATSSR,ph,S,916,true,"Tissue atlas Arabidopsis - ProteomicsDB",114,32188942,"MaxQuant score",366.6800000,0.9854070,,,,0,
EIENIMQLAGLNPNSDSATSSR,ph,T,918,true,"Large-scale phosphorylation discovery",44,23111157,XCorr,3.8570000,,,,,,
EIENIMQLAGLNPNSDSATSSR,ph,T,918,true,"LAXIC - ABA stress",84a,23660473,XCorr,4.0400000,0.8580000,,,,1.3099999705446E-5,
EIENIMQLAGLNPNSDSATSSR,ph,S,919,true,"Large-scale phosphorylation discovery",44,23111157,XCorr,3.3580000,,,,,,
EIENIMQLAGLNPNSDSATSSR,ph,S,919,true,"atm and atr DNA damage response",88,25561503,"MASCOT Score",46.0000000,0.8990000,,,,,-0.2700000
EIENIMQLAGLNPNSDSATSSR,ph,S,920,true,"TOR Kinase and ABA Receptor",100,29290610,XCorr,5.2239017,0.9012000,,,,3.6360000876812E-7,
GSGDPYGSESFQYSGNFPASK,ph,S,938,true,"Phosphorylation Early Elicitor Signaling",23,17317660,,,,,,,,
GSGDPYGSESFQYSGNFPASK,ph,S,938,true,"Large-scale phosphorylation discovery",44,23111157,XCorr,3.7090000,,,,,,
GSGDPYGSESFQYSGNFPASK,ph,S,938,true,"TOR Kinase and ABA Receptor",100,29290610,XCorr,5.9970164,0.9966000,,,,4.6220000626818E-7,
GSGDPYGSESFQYSGNFPASK,ph,S,938,true,"Tissue atlas Arabidopsis - ProteomicsDB",114,32188942,"MaxQuant score",406.0500000,1.0000000,,,,0,
GSGDPYGSESFQYSGNFPASK,ph,S,938,true,"Touch-induced phosphorylation: 40s touch vs untouc",136,30291188,"MASCOT score",126.6600000,,0.1282926,0.5938245,NO,,4.0003168
GSGDPYGSESFQYSGNFPASK,ph,S,942,true,"Tissue atlas Arabidopsis - ProteomicsDB",114,32188942,"MaxQuant score",316.5600000,0.9999890,,,,0,
