Peptide,PTM,ModifiedAA,ModifiedPosition,PeptideUniqueToGene,ExperimentDesc,ExpID,PubmedID,ScoreType,IdentScore,LocProb,Log2FChange,PQ-val,QuantSig,PEP,MassErrorPPM
DPWGGPLEINTADSATDDDRSRNLNDLDR,ph,T,15,true,"TOR Kinase and ABA Receptor",100,29290610,XCorr,5.1290832,0.8041000,,,,0.013500000350177,
DPWGGPLEINTADSATDDDRSR,ph,S,18,true,"TOR Kinase and ABA Receptor",100,29290610,XCorr,4.1946678,0.8923000,,,,0.00634799990803,
DPWGGPLEINTADSATDDDR,ph,S,18,true,"Tissue atlas Arabidopsis - ProteomicsDB",114,32188942,"MaxQuant score",137.2600000,0.9165370,,,,5.7858402203292E-29,
DPWGGPLEINTADSATDDDR,ph,T,20,true,"Plasmamembrane phosphorylation",20,15308754,,,,,,,,
DPWGGPLEINTADSATDDDR,ph,T,20,true,"Phosphorylation Early Elicitor Signaling",23,17317660,,,,,,,,
DPWGGPLEINTADSATDDDR,ph,T,20,true,"Tissue atlas Arabidopsis - ProteomicsDB",114,32188942,"MaxQuant score",184.3800000,0.9159070,,,,4.0777785311852E-43,
DPWGGPLEINTADSATDDDRSRNLNDLDR,ph,S,25,true,"TOR Kinase and ABA Receptor",100,29290610,XCorr,3.9276011,1.0000000,,,,0.00019789999350905,
DPWGGPLEINTADSATDDDRSR,ph,S,25,true,"Phosphorylation Early Elicitor Signaling",23,17317660,,,,,,,,
DPWGGPLEINTADSATDDDRSR,ph,S,25,true,"TOR Kinase and ABA Receptor",100,29290610,XCorr,4.2550807,0.9999000,,,,0.0045830002054572,
DPWGGPLEINTADSATDDDRSR,ph,S,25,true,"Tissue atlas Arabidopsis - ProteomicsDB",114,32188942,"MaxQuant score",211.1100000,0.9999160,,,,0,
AALSRPLDETQQSWLLGPTEQK,ph,S,37,true,"Phosphorylation Early Elicitor Signaling",23,17317660,,,,,,,,
AALSRPLDETQQSWLLGPTEQK,ph,S,37,true,"STN8 phosphoproteome",38,21768351,"MASCOT Score",48.7300000,,,,,,-1.4488400
AALSRPLDETQQSWLLGPTEQK,ph,S,37,true,"Large-scale phosphorylation discovery",44,23111157,XCorr,4.9290000,,,,,,
AALSRPLDETQQSWLLGPTEQK,ph,S,37,true,"TOR Kinase and ABA Receptor",100,29290610,XCorr,5.6779985,1.0000000,,,,1.6910000510961E-8,
AALSRPLDETQQSWLLGPTEQK,ph,S,37,true,"Tissue atlas Arabidopsis - ProteomicsDB",114,32188942,"MaxQuant score",252.2000000,1.0000000,,,,0,
AALSRPLDETQQSWLLGPTEQK,ph,S,46,true,"Tissue atlas Arabidopsis - ProteomicsDB",114,32188942,"MaxQuant score",157.6800000,0.9999920,,,,2.9321298758352E-38,
YVDLGCIIVSR,acy,C,64,true,"Arabidopsis S-acylation atlas - Meristem",163a,35681017,,,,,,,,
YVDLGCIIVSR,acy,C,64,true,"Arabidopsis S-acylation atlas - Hypocotyl",163b,35681017,,,,,,,,
YVDLGCIIVSR,acy,C,64,true,"Arabidopsis S-acylation atlas - Leaf",163c,35681017,,,,,,,,
YVDLGCIIVSR,acy,C,64,true,"Arabidopsis S-acylation atlas - Silique",163e,35681017,,,,,,,,
YVDLGCIIVSR,acy,C,64,true,"Arabidopsis S-acylation atlas - Stem",163f,35681017,,,,,,,,
TPPPDNYTIALHK,ng,N,108,true,"Conserved N-glycosylation",74,22633491,"MaxQuant Score",160.2000000,1.0000000,,,,2.1120000097172E-22,0.1170000
TPPPDNYTIALHK,ng,N,108,true,"ER-associatied N-glycan degradation chilling stres",133,27558752,,,,,,,,
TPPPDNYTIALHK,ng,N,108,true,"N-linked Glycan Micro-heterogeneity Arabidopsis",134,29237727,,,,,,,,
TPPPDNYTIALHK,ng,N,108,true,"UDP-GlcNAc transporter glycopeptide analysis",135,30224661,,,,,,,2.0866412710121E-13,0.4000000
HNNVSWR,ng,N,133,true,"N-linked Glycan Micro-heterogeneity Arabidopsis",134,29237727,,,,,,,,
HNNVSWR,ng,N,133,true,"UDP-GlcNAc transporter glycopeptide analysis",135,30224661,,,,,,,3.9261009078473E-5,0.5000000
KPNPNTIEGAMVAGPDKR,ac,K,555,true,"Quantitative Acetylproteomics",101,29440448,,,,,,,,
MNYNYTEPTLAGNAGLVAALVALSGEEEATGK,ng,N,567,true,"ER-associatied N-glycan degradation chilling stres",133,27558752,,,,,,,,
