Peptide,PTM,ModifiedAA,ModifiedPosition,PeptideUniqueToGene,ExperimentDesc,ExpID,PubmedID,ScoreType,IdentScore,LocProb,Log2FChange,PQ-val,QuantSig,PEP,MassErrorPPM
VARKFVVRHE,nt,V,2,true,"Arabidopsis translation initiation landscape - NT",167b,35069635,,,,,,,,
LVSVGEDSVENSDAEMLK,ph,S,76,true,"Tissue atlas Arabidopsis - ProteomicsDB",114,32188942,"MaxQuant score",79.3110000,0.9746370,,,,6.7304099502508E-5,
LVSVGEDSVENSDAEMLK,ph,S,80,true,"Large-scale phosphorylation discovery",44,23111157,XCorr,4.8280000,,,,,,
KTVPKDELEEK,ub,K,141,true,"upl3 mutant / wildtype",168,35926874,"MaxQuant score",156.0000000,1.0000000,0.5119740,0.6401600,NO,2.7211699560326E-9,0.1643700
DGVCDVTK,sno,C,327,true,"hot5-4 / wildtype, FAT-switch S-nitrosoproteome",169,37277371,,,,,,,,
SLMFESLSK,ph,S,366,true,"atm and atr DNA damage response",88,25561503,"MASCOT Score",59.0000000,1.0000000,,,,,-2.9400000
SLMFESLSK,ph,S,366,true,"Tissue atlas Arabidopsis - ProteomicsDB",114,32188942,"MaxQuant score",135.5600000,1.0000000,,,,0.00010159800149268,
SEFGSDENSSVSSSSCPVR,sno,C,430,true,"Site-specific nitrosomeproteomic id - gsnor1-3",90a,25699590,XCorr,2.9711089,,,,,0.00089219998335466,-5.6188130
SEFGSDENSSVSSSSCPVR,sno,C,430,true,"Site-specific nitrosomeproteomic id - gsnor1-3",90b,25699590,XCorr,3.9000000,,,,,8.4330000390764E-5,-6.3300000
