Peptide,PTM,ModifiedAA,ModifiedPosition,PeptideUniqueToGene,ExperimentDesc,ExpID,PubmedID,ScoreType,IdentScore,LocProb,Log2FChange,PQ-val,QuantSig,PEP,MassErrorPPM
ATGQLFSRTTQALFYN,nt,A,2,true,"Arg/N-end rule seed, prt6 vs. Wt",99,29168982,"MASCOT Score",32.6200000,,,,,0.00054580002324656,-1.3448062
ATGQLFSRTTQ,nt,A,2,true,"Arg/N-end rule seed, prt6 vs. Wt",99,29168982,"MASCOT Score",44.3300000,,,,,4.4339998567011E-5,-0.9562753
ATGQLFSR,nt,A,2,false,"Stromal N-terminome",96,26371235,"MASCOT Score",53.9800000,,,,,,
ATGQLFSR,nt,A,2,false,"Arg/N-end rule seed, prt6 vs. Wt",99,29168982,"MASCOT Score",72.6900000,,,,,0.059900000691414,-1.8848919
ATGQLFSRTTQALFYN,nta,A,2,true,"Arg/N-end rule seed, prt6 vs. Wt",99,29168982,"MASCOT Score",32.6200000,,,,,0.00054580002324656,-1.3448062
ATGQLFSRTTQALFYN,nta,A,2,true,"HUNTER N-terminome: legumain, GluC and trypsin",119,31951383,"MaxQuant score",160.6900000,,,,,,
ATGQLFSRTTQ,nta,A,2,true,"Arg/N-end rule seed, prt6 vs. Wt",99,29168982,"MASCOT Score",44.3300000,,,,,4.4339998567011E-5,-0.9562753
ATGQLFSR,nta,A,2,false,"Characterization plant N-terminal acetylation",6,22223895,"MASCOT Score",67.6600000,,,,,,
ATGQLFSR,nta,A,2,false,"Arg/N-end rule pathway Roots",80,25728785,"MASCOT Score",45.5200000,,,,,0.019969999790192,
ATGQLFSR,nta,A,2,false,"Stromal N-terminome",96,26371235,"MASCOT Score",53.9800000,,,,,,
ATGQLFSR,nta,A,2,false,"Arg/N-end rule seed, prt6 vs. Wt",99,29168982,"MASCOT Score",72.6900000,,,,,0.059900000691414,-1.8848919
ATGQLFSR,nta,A,2,false,"HUNTER N-terminome: legumain, GluC and trypsin",119,31951383,"MaxQuant score",184.4900000,,,,,,
TTQALFYNYKQLPVQR,ac,K,19,true,"Histone deacetylases - apicidin vs control",98a,29061669,"MaxQuant Score",140.0000000,1.0000000,-0.1140000,0.5382698,NO,8.7000000228864E-32,
TTQALFYNYKQLPVQR,ac,K,19,true,"Histone deacetylases substrates - hda14 vs WT",98e,29061669,"MaxQuant Score",87.1000000,1.0000000,-0.1040000,0.9099133,NO,1.9000000184288E-10,
IGDTAGTIDNIIQCK,ox,C,162,false,"SPEAR - 10 mM H2O2 / mock",138a,34619326,,,,2.8120659,0.0017037,YES,,
IGDTAGTIDNIIQCK,sno,C,162,false,"hot5-4 / wildtype, FAT-switch S-nitrosoproteome",169,37277371,,,,,,,,
IGDTAGTIDNIIQCK,so,C,162,false,"S-sulfenylation site detection using YAP1C",110,32714340,,,,,,,,
VNKPVVAWVSGTCAR,so,C,261,true,"S-sulfenylation site detection using YAP1C",110,32714340,,,,,,,,
LFKSEVQFGHAGAK,ac,K,266,false,"Histone deacetylases substrates - TSA vs control",98b,29061669,"MaxQuant Score",50.1000000,1.0000000,0.3680000,0.9794900,NO,0.0020000000949949,
LFKSEVQFGHAGAK,ac,K,266,false,"Quantitative Acetylproteomics",101,29440448,,,,,,,,
LVEEGKVSPIK,ph,S,324,false,"TOR Kinase and ABA Receptor",100,29290610,XCorr,3.6871583,1.0000000,,,,0.00043779998668469,
LVEEGKVSPIK,ph,S,324,false,"Tissue atlas Arabidopsis - ProteomicsDB",114,32188942,"MaxQuant score",115.3700000,1.0000000,,,,1.0643999530657E-6,
EVIPPQIPEDLNSAIK,ph,S,340,true,"Tissue atlas Arabidopsis - ProteomicsDB",114,32188942,"MaxQuant score",79.3170000,1.0000000,,,,0.00036590101080947,
VSGAHNTIVTAR,nt,V,417,false,"Arg/N-end rule seed, prt6 vs. Wt",99,29168982,"MASCOT Score",27.1300000,,-1.5471753,0.0046042,YES,0.17430000007153,-0.4902975
YMEYAVTVETYTLSK,ph,T,527,true,"Tyrosine phosphorylation in Arabidopsis",59,18463617,"MASCOT Score",24.0000000,,,,,,2.7706353
SIGLIGH,nt,S,579,false,"Arg/N-end rule seed, prt6 vs. Wt",99,29168982,"MASCOT Score",51.1900000,,-0.1657485,0.6391907,NO,0.14669999480247,-0.9699282
