Peptide,PTM,ModifiedAA,ModifiedPosition,PeptideUniqueToGene,ExperimentDesc,ExpID,PubmedID,ScoreType,IdentScore,LocProb,Log2FChange,PQ-val,QuantSig,PEP,MassErrorPPM
LRPLFACDPANGLTR,nt,L,31,true,"Arg/N-end rule pathway Roots",80,25728785,"MASCOT Score",56.5100000,,,,,2.8389999897627E-6,
LRPLFACDPANGLTR,nt,L,31,true,"N-terminal ChaFRADIC",92,26010716,"MASCOT Score",52.6000000,,,,,6.5779999502968E-11,
LRPLFACDPANGLTR,nt,L,31,true,"Stromal N-terminome",96,26371235,"MASCOT Score",60.2000000,,,,,,
LRPLFACDPANGLTR,nt,L,31,true,"FtsH12 N-terminome: WT / FtsH12 knockdown miRNA",118,33216923,"MaxQuant score",52.7900000,,,,,0.0023288999218494,
LRPLFACDPANGLTR,nt,L,31,true,"HUNTER N-terminome: legumain, GluC and trypsin",119,31951383,"MaxQuant score",100.4100000,,,,,,
LRPLFACDPAN,nt,L,31,true,"HUNTER N-terminome: legumain, GluC and trypsin",119,31951383,"MaxQuant score",98.2490000,,,,,,
DPANGLTR,nt,D,38,true,"Arg/N-end rule seed, prt6 vs. Wt",99,29168982,"MASCOT Score",34.1300000,,-0.4831870,0.0436369,NO,0.094449996948242,-0.1017521
LTLQEKIR,ac,K,72,true,"Quantitative Acetylproteomics",101,29440448,,,,,,,,
FGGAFPGATSFPQVITTAASFNQSLWEEIGR,ng,N,131,true,"Conserved N-glycosylation",74,22633491,"MaxQuant Score",223.3100000,1.0000000,,,,0,1.8340000
SCVYEGK,sno,C,251,true,"hot5-4 / wildtype, FAT-switch S-nitrosoproteome",169,37277371,,,,-2.1764078,0.0000354,YES,,
DSVDVFFNQQHYTSTPEEAAAR,nt,D,298,true,"Arg/N-end rule seed, prt6 vs. Wt",99,29168982,"MASCOT Score",24.4400000,,-0.7616811,0.3645770,NO,0.21170000731945,-0.9471973
QHYTSTPEE,nt,Q,307,true,"Arg/N-end rule seed, prt6 vs. Wt",99,29168982,"MASCOT Score",33.7500000,,0.3287908,0.1783111,NO,0.012640000320971,-3.0068359
YTSTPEEAAAR,nt,Y,309,true,"Arg/N-end rule seed, prt6 vs. Wt",99,29168982,"MASCOT Score",33.7700000,,0.3719890,0.1125655,NO,0.0166400000453,-1.9438851
DVCTPAHK,sno,C,384,true,"hot5-4 / wildtype, FAT-switch S-nitrosoproteome",169,37277371,,,,-2.2263766,0.0026041,YES,,
ACAYTSPLQGISR,ox,C,442,true,"SPEAR - 50 mM H2O2 / mock",138b,34619326,,,,-3.8958918,0.0137209,YES,,
ACAYTSPLQGISR,sno,C,442,true,"hot5-4 / wildtype, FAT-switch S-nitrosoproteome",169,37277371,,,,-2.0710513,0.0043374,YES,,
GLDQSIEAETR,nta,G,492,true,"FtsH12 N-terminome: WT / FtsH12 knockdown miRNA",118,33216923,"MaxQuant score",63.2830000,,,,,4.3199999133492E-11,
