Peptide,PTM,ModifiedAA,ModifiedPosition,PeptideUniqueToGene,ExperimentDesc,ExpID,PubmedID,ScoreType,IdentScore,LocProb,Log2FChange,PQ-val,QuantSig,PEP,MassErrorPPM
LVTSSFPLPK,ph,S,43,true,"atm and atr DNA damage response",88,25561503,"MASCOT Score",55.0000000,0.9960000,,,,,-0.8000000
LVTSSFPLPK,ph,S,43,true,"TOR Kinase and ABA Receptor",100,29290610,XCorr,3.0958152,0.9952000,,,,0.0005698999739252,
LVTSSFPLPK,ph,S,43,true,"Tissue atlas Arabidopsis - ProteomicsDB",114,32188942,"MaxQuant score",160.1800000,0.9990650,,,,6.1923498151373E-7,
HLTSSSTSSSPSFR,ph,T,51,true,"atm and atr DNA damage response",88,25561503,"MASCOT Score",40.0000000,1.0000000,,,,,0.2900000
HLTSSSTSSSPSFR,ph,S,53,true,"Tissue atlas Arabidopsis - ProteomicsDB",114,32188942,"MaxQuant score",121.4800000,0.7670910,,,,3.0811599572189E-5,
HLTSSSTSSSPSFR,ph,S,54,true,"atm and atr DNA damage response",88,25561503,"MASCOT Score",34.0000000,0.9700000,,,,,0.2900000
HLTSSSTSSSPSFR,ph,S,54,true,"Tissue atlas Arabidopsis - ProteomicsDB",114,32188942,"MaxQuant score",209.9300000,0.9924750,,,,1.4153114489681E-42,
HLTSSSTSSSPSFR,fuc,T,55,true,"SPINDLY O-fucosylation",162,36739885,,,,,,,0.23000000417233,
HLTSSSTSSSPSFR,ph,S,56,true,"Col-0 callus - FC Col-0 vs. Col-0 Xray",111a,31410901,,26.4600000,,-0.6268668,0.0000000,NO,,0.7546877
HLTSSSTSSSPSFR,ph,S,56,true,"Col-0 X-ray callus - FC Col-0 vs. Col-0 Xray",111b,31410901,,26.4600000,,-0.6268668,0.0000000,NO,,0.7546877
HLTSSSTSSSPSFR,ph,S,56,true,"atm callus - FC atm vs. atm Xray",111c,31410901,,26.4600000,,0.1789126,0.0000000,NO,,0.7546877
HLTSSSTSSSPSFR,ph,S,56,true,"atm-3 X-ray callus - FC atm vs. atm Xray",111d,31410901,,26.4600000,,0.1789126,0.0000000,NO,,0.7546877
HLTSSSTSSSPSFR,ph,S,57,true,"Col-0 callus - FC Col-0 vs. Col-0 Xray",111a,31410901,,26.4600000,,-0.6268668,0.0000000,NO,,0.7546877
HLTSSSTSSSPSFR,ph,S,57,true,"Col-0 X-ray callus - FC Col-0 vs. Col-0 Xray",111b,31410901,,26.4600000,,-0.6268668,0.0000000,NO,,0.7546877
HLTSSSTSSSPSFR,ph,S,57,true,"atm callus - FC atm vs. atm Xray",111c,31410901,,26.4600000,,0.1789126,0.0000000,NO,,0.7546877
HLTSSSTSSSPSFR,ph,S,57,true,"atm-3 X-ray callus - FC atm vs. atm Xray",111d,31410901,,26.4600000,,0.1789126,0.0000000,NO,,0.7546877
HLTSSSTSSSPSFR,ph,S,57,true,"Tissue atlas Arabidopsis - ProteomicsDB",114,32188942,"MaxQuant score",203.2700000,0.8760960,,,,5.3459536413992E-42,
HLTSSSTSSSPSFR,ph,S,58,true,"atm and atr DNA damage response",88,25561503,"MASCOT Score",40.0000000,1.0000000,,,,,0.2900000
HLTSSSTSSSPSFR,ph,S,58,true,"Tissue atlas Arabidopsis - ProteomicsDB",114,32188942,"MaxQuant score",209.9300000,0.9750250,,,,1.4153114489681E-42,
MLTASSSSSTTANIVYK,ph,S,112,true,"Tissue atlas Arabidopsis - ProteomicsDB",114,32188942,"MaxQuant score",193.4700000,0.8564510,,,,3.9921802144919E-39,
MLTASSSSSTTANIVYK,ph,S,114,true,"atm and atr DNA damage response",88,25561503,"MASCOT Score",25.0000000,0.9710000,,,,,0.5300000
MLTASSSSSTTANIVYK,ph,S,115,true,"atm and atr DNA damage response",88,25561503,"MASCOT Score",25.0000000,0.9710000,,,,,0.5300000
TTYGDSDLSPR,ph,S,141,true,"STN8 phosphoproteome",38,21768351,"MASCOT Score",67.1200000,,,,,,-0.4149870
TTYGDSDLSPR,ph,S,141,true,"Chloroplast kinase substrates",60,19376835,"MASCOT Score",65.0300000,,,,,,-0.6470910
TTYGDSDLSPR,ph,S,141,true,"atm and atr DNA damage response",88,25561503,"MASCOT Score",62.0000000,1.0000000,,,,,-0.4700000
TTYGDSDLSPR,ph,S,141,true,"Tissue atlas Arabidopsis - ProteomicsDB",114,32188942,"MaxQuant score",212.8300000,0.9999950,,,,7.7268697636293E-26,
TTYGDSDLSPR,ph,S,141,true,"Touch-induced phosphorylation: 40s touch vs untouc",136,30291188,"MASCOT score",76.2500000,,0.1039386,0.7084524,NO,,6.2563890
SFSGDFFER,ph,S,250,false,"srk2dei ABA signaling phopshoproteomics",83,23572148,"MASCOT Score",44.0000000,,,,,,0.0005000
SFSGDFFER,ph,S,250,false,"SnRK2 protein kinase substrates",85,23776212,XCorr,2.0017495,0.9960000,,,,0.014065200462937,
SFSGDFFER,ph,S,250,false,"TOR Kinase and ABA Receptor",100,29290610,XCorr,2.9342461,0.9917000,,,,0.0021540001034737,
SFSGDFFER,ph,S,250,false,"Tissue atlas Arabidopsis - ProteomicsDB",114,32188942,"MaxQuant score",171.8700000,0.9992230,,,,5.3960699005984E-5,
SFSGDFFER,ph,S,252,false,"atm and atr DNA damage response",88,25561503,"MASCOT Score",45.0000000,1.0000000,,,,,-0.4000000
SFSGDFFER,ph,S,252,false,"Tissue atlas Arabidopsis - ProteomicsDB",114,32188942,"MaxQuant score",136.4900000,0.9990510,,,,9.8570300906431E-5,
ITNGFGDCTLR,acy,C,266,true,"Arabidopsis S-acylation atlas - Meristem",163a,35681017,,,,,,,,
ITNGFGDCTLR,acy,C,266,true,"Arabidopsis S-acylation atlas - Seedling",163d,35681017,,,,,,,,
SWGWSFASPMR,ph,S,354,true,"TOR Kinase and ABA Receptor",100,29290610,XCorr,3.9241087,0.9203000,,,,7.9190001997631E-5,
SWGWSFASPMR,ph,S,354,true,"Tissue atlas Arabidopsis - ProteomicsDB",114,32188942,"MaxQuant score",131.0600000,0.9999970,,,,1.0949800071103E-6,
AFTSSSYSGK,ph,T,360,true,"atm and atr DNA damage response",88,25561503,"MASCOT Score",29.0000000,0.9850000,,,,,-1.6100000
AFTSSSYSGKR,ph,S,363,true,"Tissue atlas Arabidopsis - ProteomicsDB",114,32188942,"MaxQuant score",106.6700000,0.8746160,,,,2.9360100597842E-5,
AFTSSSYSGKR,ph,S,365,true,"Tissue atlas Arabidopsis - ProteomicsDB",114,32188942,"MaxQuant score",76.0100000,0.9001000,,,,0.00035700699663721,
NTTPNLGAIPSLLSVR,ph,S,390,true,"TOR Kinase and ABA Receptor",100,29290610,XCorr,4.2536130,1.0000000,,,,0.00023439999495167,
NTTPNLGAIPSLLSVR,ph,S,390,true,"Tissue atlas Arabidopsis - ProteomicsDB",114,32188942,"MaxQuant score",198.5100000,0.9908130,,,,0,
