Peptide,PTM,ModifiedAA,ModifiedPosition,PeptideUniqueToGene,ExperimentDesc,ExpID,PubmedID,ScoreType,IdentScore,LocProb,Log2FChange,PQ-val,QuantSig,PEP,MassErrorPPM
ANNPSQLLPSELIDR,nt,A,2,true,"Tic56 chloroplast import - wild-type",89a,25588737,XCorr,2.9121027,,,,,,
ANNPSQLLPSELIDR,nt,A,2,true,"Tic56 chloroplast import - ppi2",89b,25588737,XCorr,4.0326724,,,,,,
ANNPSQLLPSELIDR,nt,A,2,true,"Tic56 chloroplast import - tic56-1",89c,25588737,XCorr,4.0305743,,,,,,
ANNPSQLLPSELIDR,nt,A,2,true,"Stromal N-terminome",96,26371235,"MASCOT Score",49.7800000,,,,,,
ANNPSQLLPSELIDR,nt,A,2,true,"Arg/N-end rule seed, prt6 vs. Wt",99,29168982,"MASCOT Score",66.3500000,,0.2014550,0.3440892,NO,0.00037779999547638,-2.7824243
ANNPSQLLPSELIDR,nt,A,2,true,"FtsH12 N-terminome: WT / FtsH12 knockdown miRNA",118,33216923,"MaxQuant score",62.6460000,,,,,3.1900000863061E-8,
ANNPSQLLPSE,nt,A,2,true,"Arg/N-end rule seed, prt6 vs. Wt",99,29168982,"MASCOT Score",49.3500000,,,,,0.00080540002090856,-6.5891607
ANNPSQLLPS,nt,A,2,true,"N-term acetylation drought responses",5,26184543,,,,,,,,
ANNPSQLLPSELIDR,nta,A,2,true,"Characterization plant N-terminal acetylation",6,22223895,"MASCOT Score",68.0700000,,,,,,
ANNPSQLLPSELIDR,nta,A,2,true,"Arg/N-end rule pathway Roots",80,25728785,"MASCOT Score",63.4500000,,,,,2.4829998892528E-6,
ANNPSQLLPSELIDR,nta,A,2,true,"Tic56 chloroplast import - wild-type",89a,25588737,XCorr,2.9121027,,,,,,
ANNPSQLLPSELIDR,nta,A,2,true,"Tic56 chloroplast import - ppi2",89b,25588737,XCorr,4.0326724,,,,,,
ANNPSQLLPSELIDR,nta,A,2,true,"Tic56 chloroplast import - tic56-1",89c,25588737,XCorr,4.0305743,,,,,,
ANNPSQLLPSELIDR,nta,A,2,true,"Stromal N-terminome",96,26371235,"MASCOT Score",49.7800000,,,,,,
ANNPSQLLPSELIDR,nta,A,2,true,"Arg/N-end rule seed, prt6 vs. Wt",99,29168982,"MASCOT Score",66.3500000,,,,,0.00037779999547638,-2.7824243
ANNPSQLLPSELIDR,nta,A,2,true,"HUNTER N-terminome: legumain, GluC and trypsin",119,31951383,"MaxQuant score",205.8000000,,,,,,
ANNPSQLLPSELIDR,nta,A,2,true,"Arabidopsis translation initiation landscape - NTA",167a,35069635,,,,,,,,
ANNPSQLLPSE,nta,A,2,true,"Arg/N-end rule seed, prt6 vs. Wt",99,29168982,"MASCOT Score",49.3500000,,,,,0.00080540002090856,-6.5891607
ANNPSQLLPSE,nta,A,2,true,"HUNTER N-terminome: legumain, GluC and trypsin",119,31951383,"MaxQuant score",150.5300000,,,,,,
ANNPSQLLPS,nta,A,2,true,"N-term acetylation drought responses",5,26184543,,,,,,,,
