Peptide,PTM,ModifiedAA,ModifiedPosition,PeptideUniqueToGene,ExperimentDesc,ExpID,PubmedID,ScoreType,IdentScore,LocProb,Log2FChange,PQ-val,QuantSig,PEP,MassErrorPPM
ACAEQIASSFSR,ph,S,193,true,"Large-scale phosphorylation discovery",44,23111157,XCorr,4.8200000,,,,,,
ACAEQIASSFSR,ph,S,193,true,"Tissue atlas Arabidopsis - ProteomicsDB",114,32188942,"MaxQuant score",236.4200000,0.9304870,,,,0,
LEYSSSGR,ph,S,201,true,"atm and atr DNA damage response",88,25561503,"MASCOT Score",21.0000000,0.9930000,,,,,0.1000000
LEYSSSGR,ph,S,201,true,"Tissue atlas Arabidopsis - ProteomicsDB",114,32188942,"MaxQuant score",140.1600000,0.8685530,,,,0.00015086900384631,
LEYSSSGRLHMSR,ph,S,202,true,"Tissue atlas Arabidopsis - ProteomicsDB",114,32188942,"MaxQuant score",138.2200000,0.8972120,,,,0.00014520599506795,
LEYSSSGR,ph,S,202,true,"atm and atr DNA damage response",88,25561503,"MASCOT Score",37.0000000,0.9280000,,,,,-1.1800000
SSLCSSYSDEEPKPK,ph,S,494,true,"Phosphorylation Early Elicitor Signaling",23,17317660,,,,,,,,
SSLCSSYSDEEPKPK,ph,S,494,true,"atm and atr DNA damage response",88,25561503,"MASCOT Score",40.0000000,1.0000000,,,,,1.3400000
SSLCSSYSDEEPKPK,ph,S,494,true,"Tissue atlas Arabidopsis - ProteomicsDB",114,32188942,"MaxQuant score",329.3700000,0.9999920,,,,0,
QQQQQSWR,ph,S,507,true,"Tissue atlas Arabidopsis - ProteomicsDB",114,32188942,"MaxQuant score",127.4000000,1.0000000,,,,0.00081225298345089,
INSGALSATMSPK,ph,S,512,true,"Phosphorylation Early Elicitor Signaling",23,17317660,,,,,,,,
INSGALSATMSPK,ph,S,512,true,"Large-scale phosphorylation discovery",44,23111157,XCorr,2.7960000,,,,,,
INSGALSATMSPK,ph,S,512,true,"atm and atr DNA damage response",88,25561503,"MASCOT Score",62.0000000,0.9970000,,,,,0.4700000
INSGALSATMSPK,ph,S,512,true,"Tissue atlas Arabidopsis - ProteomicsDB",114,32188942,"MaxQuant score",162.8200000,1.0000000,,,,1.7603500601648E-10,
INSGALSATMSPK,ph,S,516,true,"atm and atr DNA damage response",88,25561503,"MASCOT Score",76.0000000,1.0000000,,,,,-0.0200000
INSGALSATMSPK,ph,S,516,true,"Tissue atlas Arabidopsis - ProteomicsDB",114,32188942,"MaxQuant score",137.7300000,0.9796940,,,,4.6369201299967E-5,
INSGALSATMSPK,ph,T,518,true,"atm and atr DNA damage response",88,25561503,"MASCOT Score",43.0000000,0.9920000,,,,,-0.2300000
INSGALSATMSPK,ph,T,518,true,"Tissue atlas Arabidopsis - ProteomicsDB",114,32188942,"MaxQuant score",213.9900000,0.8683820,,,,0,
INSGALSATMSPKDNYASLR,ph,S,520,true,"Tissue atlas Arabidopsis - ProteomicsDB",114,32188942,"MaxQuant score",214.7300000,0.9917920,,,,0,
INSGALSATMSPK,ph,S,520,true,"Phosphorylation Early Elicitor Signaling",23,17317660,,,,,,,,
INSGALSATMSPK,ph,S,520,true,"Phytohormone-responsive phosphoproteins",34,20374526,"MASCOT Score",77.0000000,,,,,,-7.2401000
INSGALSATMSPK,ph,S,520,true,"atm and atr DNA damage response",88,25561503,"MASCOT Score",96.0000000,1.0000000,,,,,-1.2000000
INSGALSATMSPK,ph,S,520,true,"TOR Kinase and ABA Receptor",100,29290610,XCorr,3.3348992,0.9922000,,,,0.017570000141859,
DNYASLRR,ph,S,527,true,"Tissue atlas Arabidopsis - ProteomicsDB",114,32188942,"MaxQuant score",82.8310000,0.9999980,,,,0.0062679299153388,
KFMSSFSK,ph,S,571,true,"Tissue atlas Arabidopsis - ProteomicsDB",114,32188942,"MaxQuant score",99.7880000,0.7566260,,,,0.0020037100184709,
KFMSSFSK,ph,S,573,true,"atm and atr DNA damage response",88,25561503,"MASCOT Score",25.0000000,0.9910000,,,,,-3.3900000
KFMSSFSK,ph,S,573,true,"Tissue atlas Arabidopsis - ProteomicsDB",114,32188942,"MaxQuant score",105.5200000,0.9999590,,,,0.001496950048022,
LSFFGHSSSR,ph,S,585,true,"atm and atr DNA damage response",88,25561503,"MASCOT Score",45.0000000,1.0000000,,,,,0.8400000
LSFFGHSSSR,ph,S,586,true,"Tissue atlas Arabidopsis - ProteomicsDB",114,32188942,"MaxQuant score",152.4000000,0.8176280,,,,6.1708800558335E-7,
LSFFGHSSSR,ph,S,587,true,"atm and atr DNA damage response",88,25561503,"MASCOT Score",48.0000000,0.8790000,,,,,-0.4700000
LSFFGHSSSR,ph,S,587,true,"Tissue atlas Arabidopsis - ProteomicsDB",114,32188942,"MaxQuant score",123.9500000,0.9634200,,,,0.00010379900049884,
GSSSPSKQSFR,ph,S,591,true,"atm and atr DNA damage response",88,25561503,"MASCOT Score",31.0000000,1.0000000,,,,,0.2800000
GSSSPSKQSFR,ph,S,597,true,"atm and atr DNA damage response",88,25561503,"MASCOT Score",31.0000000,1.0000000,,,,,0.2800000
TDSKVLMER,ph,S,602,true,"Tissue atlas Arabidopsis - ProteomicsDB",114,32188942,"MaxQuant score",96.2300000,0.9992670,,,,0.0024230999406427,
