Peptide,PTM,ModifiedAA,ModifiedPosition,PeptideUniqueToGene,ExperimentDesc,ExpID,PubmedID,ScoreType,IdentScore,LocProb,Log2FChange,PQ-val,QuantSig,PEP,MassErrorPPM
MDSTAATKR,nta,M,1,true,"Arabidopsis translation initiation landscape - NTA",167a,35069635,,,,,,,,
TEITCK,ox,C,212,true,"OxiTRAQ Arabidopsis - 5 mM H2O2 versus control",47,24376095,,,,-0.3640621,0.0388411,NO,,
EVADDSQKNYDPDDGLADAPK,ph,S,219,true,"Tissue atlas Arabidopsis - ProteomicsDB",114,32188942,"MaxQuant score",289.8600000,1.0000000,,,,0,
DKFGVPAVSLPSPK,ph,S,257,true,"Phosphorylation RNA metabolism",22,16807317,,,,,,,,
DKFGVPAVSLPSPK,ph,S,257,true,"Phosphorylation nuclei-enriched fractions",28,19245862,,,,,,,,
DKFGVPAVSLPSPK,ph,S,257,true,"Phosphoproteome ethylene-regulated time response",46,24043427,"MASCOT Score",59.1400000,,,,,,7.4060000
DKFGVPAVSLPSPK,ph,S,257,true,"SnRK2 protein kinase substrates",85,23776212,XCorr,3.8028381,1.0000000,,,,3.96250006599E-16,
DKFGVPAVSLPSPK,ph,S,257,true,"atm and atr DNA damage response",88,25561503,"MASCOT Score",41.0000000,1.0000000,,,,,-2.2500000
DKFGVPAVSLPSPK,ph,S,257,true,"Col-0 callus - FC Col-0 vs. Col-0 Xray",111a,31410901,,60.9500000,,0.5936171,0.0000000,NO,,0.7706879
DKFGVPAVSLPSPK,ph,S,257,true,"Col-0 X-ray callus - FC Col-0 vs. Col-0 Xray",111b,31410901,,60.9500000,,0.5936171,0.0000000,NO,,0.7706879
DKFGVPAVSLPSPK,ph,S,257,true,"atm callus - FC atm vs. atm Xray",111c,31410901,,60.9500000,,0.9882414,0.0000000,NO,,0.7706879
DKFGVPAVSLPSPK,ph,S,257,true,"atm-3 X-ray callus - FC atm vs. atm Xray",111d,31410901,,60.9500000,,0.9882414,0.0000000,NO,,0.7706879
DKFGVPAVSLPSPK,ph,S,257,true,"Tissue atlas Arabidopsis - ProteomicsDB",114,32188942,"MaxQuant score",200.6700000,0.9998580,,,,2.6485101421943E-32,
DKFGVPAVSLPSPK,ph,S,257,true,"Touch-induced phosphorylation: 40s touch vs untouc",136,30291188,"MASCOT score",66.4200000,,-0.2503967,0.6705356,NO,,6.7975649
FGVPAVSLPSPKK,ph,S,257,true,"TOR Kinase and ABA Receptor",100,29290610,XCorr,3.0736403,0.9866000,,,,0.00047589998575859,
FGVPAVSLPSPK,ph,S,257,true,"Arabidopsis root NAA phosphoproteome",18a,27643528,"MaxQuant Score",47.5480000,0.9330000,,,,0.00095650000730529,-0.2720000
FGVPAVSLPSPK,ph,S,257,true,"atm and atr DNA damage response",88,25561503,"MASCOT Score",43.0000000,1.0000000,,,,,0.1600000
FGVPAVSLPSPK,ph,S,257,true,"TOR Kinase and ABA Receptor",100,29290610,XCorr,3.2497520,0.9996000,,,,0.00022570000146516,
FGVPAVSLPSPK,ph,S,257,true,"Lateral root-induction - NAA vs control",106,23328941,"MASCOT Score",41.0000000,,,,,,
FGVPAVSLPSPK,ph,S,257,true,"Phospho cell culture sucrose/TOR",109,30833711,,,0.9989310,,,,,
FGVPAVSLPSPK,ph,S,257,true,"Col-0 callus - FC Col-0 vs. Col-0 Xray",111a,31410901,,77.1900000,,0.5971439,0.0000000,NO,,0.1764177
FGVPAVSLPSPK,ph,S,257,true,"Col-0 X-ray callus - FC Col-0 vs. Col-0 Xray",111b,31410901,,77.1900000,,0.5971439,0.0000000,NO,,0.1764177
FGVPAVSLPSPK,ph,S,257,true,"atm callus - FC atm vs. atm Xray",111c,31410901,,77.1900000,,1.1126471,0.0000000,NO,,0.1764177
FGVPAVSLPSPK,ph,S,257,true,"atm-3 X-ray callus - FC atm vs. atm Xray",111d,31410901,,77.1900000,,1.1126471,0.0000000,NO,,0.1764177
DQEHQAPSDPSTGQILK,ph,S,271,true,"Tissue atlas Arabidopsis - ProteomicsDB",114,32188942,"MaxQuant score",73.7580000,0.9588270,,,,0.00043600000208244,
