Peptide,PTM,ModifiedAA,ModifiedPosition,PeptideUniqueToGene,ExperimentDesc,ExpID,PubmedID,ScoreType,IdentScore,LocProb,Log2FChange,PQ-val,QuantSig,PEP,MassErrorPPM
DQANIDCLR,nt,D,28,true,"Arg/N-end rule pathway Roots",80,25728785,"MASCOT Score",26.8900000,,,,,0.04797999933362,
DQANIDCLR,nt,D,28,true,"Arg/N-end rule seed, prt6 vs. Wt",99,29168982,"MASCOT Score",48.9300000,,-0.0916552,0.3163544,NO,0.0094290003180504,-1.7030166
DQANIDCLR,nta,D,28,true,"FtsH12 N-terminome: WT / FtsH12 knockdown miRNA",118,33216923,"MaxQuant score",142.8300000,,,,,9.7600001118388E-25,
TFKSQVEDPNR,ac,K,39,true,"Quantitative Acetylproteomics",101,29440448,,,,,,,,
LCADLTGLDLSR,sno,C,99,true,"hot5-4 / wildtype, FAT-switch S-nitrosoproteome",169,37277371,,,,,,,,
LKTFSVSDNR,ph,T,177,true,"atm and atr DNA damage response",88,25561503,"MASCOT Score",32.0000000,0.9960000,,,,,-3.3500000
LVGPIPNFNQTLQFK,ng,N,193,true,"Conserved N-glycosylation",74,22633491,"MaxQuant Score",105.4500000,0.9900000,,,,1.262999944629E-6,-0.2550000
LVGPIPNFNQTLQFK,ng,N,193,true,"N-linked Glycan Micro-heterogeneity Arabidopsis",134,29237727,,,,,,,,
LVGPIPNFNQTLQFK,ng,N,193,true,"UDP-GlcNAc transporter glycopeptide analysis",135,30224661,,,,,,,4.7481622998422E-18,0.1000000
TLGSVKNR,ub,K,354,true,"Ubiquitination Membrane Proteins",120,33585938,,,,,,,,
ATSVTKVSEEKAEEENFK,ph,S,514,true,"Tissue atlas Arabidopsis - ProteomicsDB",114,32188942,"MaxQuant score",51.3900000,0.8927570,,,,0.00092751299962401,
VLKVACNCVLPEIAK,ub,K,562,true,"Ubiquitination Membrane Proteins",120,33585938,,,,,,,,
