Peptide,PTM,ModifiedAA,ModifiedPosition,PeptideUniqueToGene,ExperimentDesc,ExpID,PubmedID,ScoreType,IdentScore,LocProb,Log2FChange,PQ-val,QuantSig,PEP,MassErrorPPM
QDSPEIRPLPPLPPR,ph,S,192,true,"atm and atr DNA damage response",88,25561503,"MASCOT Score",26.0000000,1.0000000,,,,,0.3000000
QDSPEIRPLPPLPPR,ph,S,192,true,"Tissue atlas Arabidopsis - ProteomicsDB",114,32188942,"MaxQuant score",54.3550000,1.0000000,,,,0.0011941399425268,
SFSITMSPPNPR,ph,S,259,true,"Tissue atlas Arabidopsis - ProteomicsDB",114,32188942,"MaxQuant score",85.2870000,0.9287180,,,,0.00050925801042467,
SFSITMSPPNPR,ph,S,265,true,"Tissue atlas Arabidopsis - ProteomicsDB",114,32188942,"MaxQuant score",123.0200000,0.9991670,,,,1.0327799827792E-5,
YSDATNLQSPSPER,ph,S,279,true,"atm and atr DNA damage response",88,25561503,"MASCOT Score",62.0000000,1.0000000,,,,,-0.3800000
YSDATNLQSPSPER,ph,S,279,true,"Tissue atlas Arabidopsis - ProteomicsDB",114,32188942,"MaxQuant score",249.5400000,1.0000000,,,,0,
YSDATNLQSPSPER,ph,S,281,true,"atm and atr DNA damage response",88,25561503,"MASCOT Score",62.0000000,1.0000000,,,,,-0.3800000
YSDATNLQSPSPER,ph,S,281,true,"Tissue atlas Arabidopsis - ProteomicsDB",114,32188942,"MaxQuant score",249.5400000,1.0000000,,,,0,
ISSASTSPDR,ph,S,317,true,"atm and atr DNA damage response",88,25561503,"MASCOT Score",21.0000000,0.9760000,,,,,-0.6100000
ISSASTSPDRGFIR,ph,S,318,true,"Tissue atlas Arabidopsis - ProteomicsDB",114,32188942,"MaxQuant score",49.3430000,0.8739050,,,,0.010600100271404,
ISSASTSPDRGFIR,ph,S,322,true,"Tissue atlas Arabidopsis - ProteomicsDB",114,32188942,"MaxQuant score",92.7810000,0.9539390,,,,5.6356799177593E-5,
ISSASTSPDR,ph,S,322,true,"atm and atr DNA damage response",88,25561503,"MASCOT Score",21.0000000,0.9650000,,,,,-0.6100000
SVLLSHTASSR,ph,S,375,true,"atm and atr DNA damage response",88,25561503,"MASCOT Score",48.0000000,0.8410000,,,,,0.1100000
SVLLSHTASSR,ph,S,375,true,"Tissue atlas Arabidopsis - ProteomicsDB",114,32188942,"MaxQuant score",128.9000000,0.8122100,,,,7.4760700954357E-6,
KQSFSDQPPK,ph,S,423,true,"atm and atr DNA damage response",88,25561503,"MASCOT Score",43.0000000,1.0000000,,,,,-3.3700000
KQSFSDQPPK,ph,S,423,true,"Tissue atlas Arabidopsis - ProteomicsDB",114,32188942,"MaxQuant score",111.9600000,0.9658980,,,,0.0017819199711084,
