Peptide,PTM,ModifiedAA,ModifiedPosition,PeptideUniqueToGene,ExperimentDesc,ExpID,PubmedID,ScoreType,IdentScore,LocProb,Log2FChange,PQ-val,QuantSig,PEP,MassErrorPPM
VSDSQNSQTCLDPDASSSVLGIILGGGAGTR,nt,V,72,true,"N-terminal ChaFRADIC",92,26010716,"MASCOT Score",96.2900000,,,,,2.7289999721006E-15,
VSDSQNSQTCLDPDASSSVLGIILGGGAGTR,nt,V,72,true,"Stromal N-terminome",96,26371235,"MASCOT Score",87.0900000,,,,,,
VSDSQNSQTCLDPDASSSVLGIILGGGAGTR,nt,V,72,true,"FtsH12 N-terminome: WT / FtsH12 knockdown miRNA",118,33216923,"MaxQuant score",77.6810000,,-0.0184129,0.9024717,NO,0.00073947000782937,
VSDSQNSQTCLDPDASSSVLGIILGGGAGTR,nt,V,72,true,"HUNTER N-terminome: legumain, GluC and trypsin",119,31951383,"MaxQuant score",141.9000000,,,,,,
VSDSQNSQTCLDPDASSSVLGIILGGGAGTR,nta,V,72,true,"N-terminal ChaFRADIC",92,26010716,"MASCOT Score",75.7900000,,,,,1.8549999936113E-7,
VSDSQNSQTCLDPDASSSVLGIILGGGAGTR,nta,V,72,true,"Stromal N-terminome",96,26371235,"MASCOT Score",63.3700000,,,,,,
VSDSQNSQTCLDPDASSSVLGIILGGGAGTR,nta,V,72,true,"HUNTER N-terminome: legumain, GluC and trypsin",119,31951383,"MaxQuant score",305.4200000,,,,,,
LIDIPVSNCLNSNISK,sno,C,131,true,"Site-specific nitrosomeproteomic id - gsnor1-3",90a,25699590,XCorr,2.9796681,,,,,0.15800000727177,-5.3018731
LIDIPVSNCLNSNISK,sno,C,131,true,"Site-specific nitrosomeproteomic id - gsnor1-3",90b,25699590,XCorr,2.8700000,,,,,9.4009999884292E-5,-7.4300000
LIDIPVSNCLNSNISK,sno,C,131,true,"hot5-4 / wildtype, FAT-switch S-nitrosoproteome",169,37277371,,,,0.8429563,0.0021541,YES,,
LIDIPVSNCLNSNISK,so,C,131,true,"S-sulfenylation site detection using YAP1C",110,32714340,,,,,,,,
IYVLTQFNSASLNR,ph,S,149,true,"Tissue atlas Arabidopsis - ProteomicsDB",114,32188942,"MaxQuant score",125.2800000,0.8904810,,,,3.745860158233E-5,
WFQGTADAVR,ph,T,189,false,"atm and atr DNA damage response",88,25561503,"MASCOT Score",50.0000000,1.0000000,,,,,0.3100000
WFQGTADAVR,ph,T,189,false,"Tissue atlas Arabidopsis - ProteomicsDB",114,32188942,"MaxQuant score",88.1870000,1.0000000,,,,0.0042554601095617,
MDYEKFIQAHR,ac,K,223,true,"Histone deacetylases substrates - hda14 vs WT",98e,29061669,"MaxQuant Score",87.2000000,1.0000000,-0.1290000,0.8709636,NO,1.700000029814E-5,
ETDADITVAALPMDEQRATAFGLMK,ph,T,236,true,"srk2dei ABA signaling phopshoproteomics",83,23572148,"MASCOT Score",24.0000000,,,,,,-0.0048000
IIEFAEKPK,ac,K,267,true,"Histone deacetylases - apicidin vs control",98a,29061669,"MaxQuant Score",93.1000000,1.0000000,0.2620000,0.2985383,NO,0.0049999998882413,
IIEFAEKPK,ac,K,267,true,"Histone deacetylases substrates - hda14 vs WT",98e,29061669,"MaxQuant Score",58.7000000,1.0000000,0.0540000,0.9289664,NO,0.0089999996125698,
IIEFAEKPK,ac,K,267,true,"Quantitative Acetylproteomics",101,29440448,,,,,,,,
SAPIYTQPR,nt,S,377,true,"N-terminal ChaFRADIC",92,26010716,"MASCOT Score",24.8800000,,,,,0.025569999590516,
SAPIYTQPR,nt,S,377,true,"Arabidopsis translation initiation landscape - NT",167b,35069635,,,,,,,,
GSVPIGIGKNSHIK,ac,K,462,true,"Quantitative Acetylproteomics",101,29440448,,,,,,,,
