Peptide,PTM,ModifiedAA,ModifiedPosition,PeptideUniqueToGene,ExperimentDesc,ExpID,PubmedID,ScoreType,IdentScore,LocProb,Log2FChange,PQ-val,QuantSig,PEP,MassErrorPPM
DVCIVGVAR,acy,C,9,true,"Arabidopsis S-acylation atlas - Hypocotyl",163b,35681017,,,,,,,,
DVCIVGVAR,ox,C,9,true,"OxiTRAQ Arabidopsis - 5 mM H2O2 versus control",47,24376095,,,,-0.0087074,0.6904887,NO,,
DVCIVGVAR,so,C,9,true,"S-sulfenylation site detection using YAP1C",110,32714340,,,,,,,,
LGSLAIAAALKR,ub,K,43,true,"upl3 mutant / wildtype",168,35926874,"MaxQuant score",134.5700000,1.0000000,0.9523336,0.0030150,YES,2.636429963232E-9,-0.2169300
QAALGAGIPNSVICTTVNK,sno,C,85,true,"hot5-4 / wildtype, FAT-switch S-nitrosoproteome",169,37277371,,,,,,,,
VCASGMK,sno,C,92,true,"hot5-4 / wildtype, FAT-switch S-nitrosoproteome",169,37277371,,,,,,,,
DVVVAGGME,nt,D,112,true,"Arg/N-end rule seed, prt6 vs. Wt",99,29168982,"MASCOT Score",52.1500000,,-0.4960789,0.4068403,NO,0.0028719999827445,-2.0289573
GRPSTIVDKDEGLGK,ac,K,221,true,"Quantitative Acetylproteomics",101,29440448,,,,,,,,
DEGLGKFDAAK,ac,K,227,false,"Histone deacetylases - apicidin vs control",98a,29061669,"MaxQuant Score",79.5000000,1.0000000,0.1250000,0.4497799,NO,0.00049000000581145,
DEGLGKFDAAK,ac,K,227,false,"Histone deacetylases substrates - hda14 vs WT",98e,29061669,"MaxQuant Score",61.5000000,1.0000000,0.3710000,0.2897344,NO,0.0020000000949949,
FDAAKLR,ac,K,232,true,"Quantitative Acetylproteomics",101,29440448,,,,,,,,
IKGYGDAAQEPEFFTTAPALAIPK,ub,K,282,true,"upl3 mutant / wildtype",168,35926874,"MaxQuant score",60.4720000,1.0000000,0.1928254,,,4.4725102270604E-6,-0.2901900
SSQVDYYEINE,nt,S,313,true,"N-terminal ChaFRADIC",92,26010716,"MASCOT Score",61.7200000,,,,,0.00019010000687558,
SSQVDYYE,nt,S,313,true,"N-terminal ChaFRADIC",92,26010716,"MASCOT Score",28.4700000,,,,,0.029589999467134,
SSQVDYYE,nt,S,313,true,"Arg/N-end rule seed, prt6 vs. Wt",99,29168982,"MASCOT Score",21.4800000,,-0.6684575,0.1241419,NO,0.0153299998492,-1.5871729
VNVNGGAVSLGHPLGCSGAR,so,C,358,true,"Arabidopsis S-sulfenylation chemoproteomics",108,31578252,"pFind PSM Score",0.2525670,,,,,,-0.7151301
