Peptide,PTM,ModifiedAA,ModifiedPosition,PeptideUniqueToGene,ExperimentDesc,ExpID,PubmedID,ScoreType,IdentScore,LocProb,Log2FChange,PQ-val,QuantSig,PEP,MassErrorPPM
AWRGSIS,nt,A,2,true,"Arg/N-end rule seed, prt6 vs. Wt",99,29168982,"MASCOT Score",28.9600000,,,,,0.040059998631477,-0.0640172
AWRGSIS,nta,A,2,true,"Arg/N-end rule seed, prt6 vs. Wt",99,29168982,"MASCOT Score",28.9600000,,,,,0.040059998631477,-0.0640172
GSISKSMK,ac,K,9,true,"Quantitative Acetylproteomics",101,29440448,,,,,,,,
GSISKSMKELR,ub,K,9,true,"Arabidopsis ubiquitination COFRADIC",40,26744219,"MaxQuant Score",40.4750000,0.9960000,,,,0.013000000268221,0.2010000
GSISKSMKELR,ub,K,12,true,"Arabidopsis ubiquitination COFRADIC",40,26744219,"MaxQuant Score",48.5680000,0.9510000,,,,0.0060000000521541,-0.0360000
ILLCQSSPASAPTR,ox,C,19,true,"OxiTRAQ Arabidopsis - 5 mM H2O2 versus control",47,24376095,,,,1.4019635,0.0142258,YES,,
ILLCQSSPASAPTR,ox,C,19,true,"Redox kickstart of mitochondria",112,31871212,,,,-1.6820134,0.0000008,YES,,
ILLCQSSPASAPTR,so,C,19,true,"S-sulfenylation site detection using YAP1C",110,32714340,,,,,,,,
QSSPASAPTRTFVE,nt,Q,20,true,"Arg/N-end rule seed, prt6 vs. Wt",99,29168982,"MASCOT Score",28.8100000,,-0.6547826,0.0013088,NO,0.00010019999899669,-1.9206408
QSSPASAPTR,nt,Q,20,true,"Arg/N-end rule seed, prt6 vs. Wt",99,29168982,"MASCOT Score",37.9500000,,-0.8512929,0.0016350,NO,0.035969998687506,-0.3262325
ECSGVQPQMWAR,ox,C,53,true,"Redox kickstart of mitochondria",112,31871212,,,,-1.1248023,0.0010889,YES,,
CVNLDGLTEPQILK,ox,C,71,true,"Redox kickstart of mitochondria",112,31871212,,,,-1.4050863,0.0011338,YES,,
CVNLDGLTEPQILK,sno,C,71,true,"hot5-4 / wildtype, FAT-switch S-nitrosoproteome",169,37277371,,,,,,,,
CVNLDGLTEPQILK,so,C,71,true,"S-sulfenylation site detection using YAP1C",110,32714340,,,,,,,,
ALENLVKSGATKA,ac,K,91,true,"Quantitative Acetylproteomics",101,29440448,,,,,,,,
ALENLVKSGATK,ac,K,91,true,"Quantitative Acetylproteomics",101,29440448,,,,,,,,
