Peptide,PTM,ModifiedAA,ModifiedPosition,PeptideUniqueToGene,ExperimentDesc,ExpID,PubmedID,ScoreType,IdentScore,LocProb,Log2FChange,PQ-val,QuantSig,PEP,MassErrorPPM
IMISGAPASGK,mox,M,68,true,"cat2 Methionine oxidation - 1h stress",62a,25693801,"MASCOT Score",85.0000000,,-0.0916416,,NO,,
IMISGAPASGK,mox,M,68,true,"cat2 Methionine oxidation - 3h stress",62b,25693801,"MASCOT Score",81.0000000,,-0.1328104,,NO,,
IMISGAPASGKGTQCELITHK,ph,T,79,true,"Tissue atlas Arabidopsis - ProteomicsDB",114,32188942,"MaxQuant score",77.4450000,0.9324620,,,,8.2285896496614E-6,
GTQCELITHK,sno,C,81,true,"Site-specific nitrosomeproteomic id - gsnor1-3",90a,25699590,XCorr,2.6064272,,,,,0.0053110001608729,-5.8207531
GTQCELITHK,so,C,81,true,"Arabidopsis S-sulfenylation chemoproteomics",108,31578252,"pFind PSM Score",0.0255766,,1.5521200,,,,-0.9510908
LDPVTGKIYHLK,ac,K,196,true,"Histone deacetylases - apicidin vs control",98a,29061669,"MaxQuant Score",61.2000000,1.0000000,0.5870000,0.0591562,NO,0.010999999940395,
FDDTEEKAK,ac,K,224,true,"Histone deacetylases - apicidin vs control",98a,29061669,"MaxQuant Score",138.2000000,1.0000000,0.8060000,0.0178238,YES,9.9999997473788E-5,
FDDTEEKAK,ac,K,224,true,"Quantitative Acetylproteomics",101,29440448,,,,,,,,
FDDTEEKAKLR,ub,K,224,true,"Arabidopsis ubiquitination COFRADIC",40,26744219,"MaxQuant Score",59.1980000,0.9730000,,,,0.0020000000949949,-0.5410000
FDDTEEKAKLR,ub,K,226,true,"Arabidopsis ubiquitination COFRADIC",40,26744219,"MaxQuant Score",74.6110000,0.9780000,,,,3.1279998893297E-6,0.5460000
