Peptide,PTM,ModifiedAA,ModifiedPosition,PeptideUniqueToGene,ExperimentDesc,ExpID,PubmedID,ScoreType,IdentScore,LocProb,Log2FChange,PQ-val,QuantSig,PEP,MassErrorPPM
QIQDDCSTVVK,ox,C,236,true,"OxiTRAQ Arabidopsis - 5 mM H2O2 versus control",47,24376095,,,,-0.1986436,0.0814861,NO,,
LTTDYYALNSSEQQFPNQEK,ng,N,291,true,"Conserved N-glycosylation",74,22633491,"MaxQuant Score",220.7200000,1.0000000,,,,0,1.7230000
VNGAVETCGESFHR,sno,C,469,false,"hot5-4 / wildtype, FAT-switch S-nitrosoproteome",169,37277371,,,,,,,,
YLNFSNPLISK,ng,N,481,true,"Conserved N-glycosylation",74,22633491,"MaxQuant Score",93.9110000,0.9880000,,,,0.00053129997104406,1.8240000
YLNFSNPLISK,ng,N,481,true,"N-linked Glycan Micro-heterogeneity Arabidopsis",134,29237727,,,,,,,,
YLNFSNPLISK,ng,N,481,true,"UDP-GlcNAc transporter glycopeptide analysis",135,30224661,,,,,,,7.4147348641418E-5,1.2000000
QNITEVYHR,ng,N,514,true,"Conserved N-glycosylation",74,22633491,"MaxQuant Score",106.5800000,1.0000000,,,,0.00064779998501763,0.9740000
QNITEVYHR,ng,N,514,true,"UDP-GlcNAc transporter glycopeptide analysis",135,30224661,,,,,,,1.7921078324434E-5,0.3000000
