Peptide,PTM,ModifiedAA,ModifiedPosition,PeptideUniqueToGene,ExperimentDesc,ExpID,PubmedID,ScoreType,IdentScore,LocProb,Log2FChange,PQ-val,QuantSig,PEP,MassErrorPPM
LLVASCVSEITR,so,C,79,true,"Arabidopsis S-sulfenylation chemoproteomics",108,31578252,"pFind PSM Score",0.0100685,,1.6129000,,,,-1.3832054
VIEHCAPK,sno,C,219,true,"hot5-4 / wildtype, FAT-switch S-nitrosoproteome",169,37277371,,,,-0.3716884,0.1205330,NO,,
DCLLSDPLR,sno,C,333,true,"hot5-4 / wildtype, FAT-switch S-nitrosoproteome",169,37277371,,,,,,,,
AEASQIISALCDR,sno,C,351,true,"hot5-4 / wildtype, FAT-switch S-nitrosoproteome",169,37277371,,,,0.2386463,0.0008713,NO,,
CLYDKDFR,ox,C,438,true,"SPEAR - 10 mM H2O2 / mock",138a,34619326,,,,-2.3084656,0.0209628,YES,,
ILFGFRVMSR,ph,S,530,true,"Phosphorylation in N starvation",63,22060019,"MASCOT Score",23.0000000,,,,,,5.2883100
ILTNLLDPNTSITQASR,ph,T,566,true,"SIRK1 phosphorylation",86a,23820729,"MaxQuant Score",101.5900000,0.7700000,,,,0.66000002622604,4.7670000
ILTNLLDPNTSITQASR,ph,T,569,true,"SIRK1 phosphorylation",86a,23820729,"MaxQuant Score",109.0600000,0.8970000,,,,0.41299998760223,6.4830000
ILTNLLDPNTSITQASR,ph,T,569,true,"SIRK1 exp - sirk1 mutant vs WT",86b,23820729,,,,0.3788194,,NO,,
ILTNLLDPNTSITQASR,ph,T,569,true,"SIRK1 exp - 35S:SIRK1 vs WT",86c,23820729,,,,1.0320592,,NO,,
ILTNLLDPNTSITQASR,ph,S,572,true,"SIRK1 phosphorylation",86a,23820729,"MaxQuant Score",126.9000000,0.9990000,,,,0.097000002861023,5.1880000
ILTNLLDPNTSITQASR,ph,S,572,true,"SIRK1 exp - sirk1 mutant vs WT",86b,23820729,,,,0.3788194,,NO,,
ILTNLLDPNTSITQASR,ph,S,572,true,"SIRK1 exp - 35S:SIRK1 vs WT",86c,23820729,,,,1.0320592,,NO,,
ICVEGNR,sno,C,698,true,"hot5-4 / wildtype, FAT-switch S-nitrosoproteome",169,37277371,,,,-0.3236840,0.1849849,NO,,
LKSETVDDK,ac,K,779,true,"Quantitative Acetylproteomics",101,29440448,,,,,,,,
LSWDDKSEICQLK,ox,C,797,true,"SPEAR - 50 mM H2O2 / mock",138b,34619326,,,,1.4081754,0.0182473,YES,,
SEICQLK,sno,C,797,true,"hot5-4 / wildtype, FAT-switch S-nitrosoproteome",169,37277371,,,,0.1437517,0.6359791,NO,,
LESHADASVIPQTSENEVMIDGESDGNEIPLGK,ph,T,1130,true,"srk2dei ABA signaling phopshoproteomics",83,23572148,"MASCOT Score",68.0000000,,,,,,-0.0042000
LESHADASVIPQTSENEVMIDGESDGNEIPLGK,ph,S,1131,true,"srk2dei ABA signaling phopshoproteomics",83,23572148,"MASCOT Score",44.0000000,,,,,,-0.0010000
LESHADASVIPQTSENEVMIDGESDGNEIPLGK,ph,S,1131,true,"TOR Kinase and ABA Receptor",100,29290610,XCorr,5.1777153,0.8010000,,,,0.0016349999932572,
LESHADASVIPQTSENEVMIDGESDGNEIPLGK,ph,S,1131,true,"Tissue atlas Arabidopsis - ProteomicsDB",114,32188942,"MaxQuant score",152.5300000,0.8146090,,,,0,
LESHADASVIPQTSENEVMIDGESDGNEIPLGK,ph,S,1141,true,"Arabidopsis root NAA phosphoproteome",18a,27643528,"MaxQuant Score",59.7930000,0.9960000,,,,1.3569999737228E-6,1.9370000
LESHADASVIPQTSENEVMIDGESDGNEIPLGK,ph,S,1141,true,"srk2dei ABA signaling phopshoproteomics",83,23572148,"MASCOT Score",72.0000000,,,,,,-0.0031000
LESHADASVIPQTSENEVMIDGESDGNEIPLGK,ph,S,1141,true,"SnRK2 protein kinase substrates",85,23776212,XCorr,4.5169473,1.0000000,,,,5.4627898862236E-6,
LESHADASVIPQTSENEVMIDGESDGNEIPLGK,ph,S,1141,true,"Brassinosteroid-Regulated Phosphorylation Dynamics",94,26187819,"MaxQuant Score",88.7080000,1.0000000,,,,3.1580000836584E-7,1.0320000
LESHADASVIPQTSENEVMIDGESDGNEIPLGK,ph,S,1141,true,"TOR Kinase and ABA Receptor",100,29290610,XCorr,5.1777153,0.9995000,,,,0.0016349999932572,
LESHADASVIPQTSENEVMIDGESDGNEIPLGK,ph,S,1141,true,"Phospho cell culture sucrose/TOR",109,30833711,,,0.9999980,,,,,
LESHADASVIPQTSENEVMIDGESDGNEIPLGK,ph,S,1141,true,"Tissue atlas Arabidopsis - ProteomicsDB",114,32188942,"MaxQuant score",214.4200000,1.0000000,,,,0,
SSNGHKHSPSERAE,nt,S,1204,true,"Arabidopsis translation initiation landscape - NT",167b,35069635,,,,,,,,
FESSNGHKHSPSER,ph,S,1211,true,"atm and atr DNA damage response",88,25561503,"MASCOT Score",26.0000000,1.0000000,,,,,1.7800000
FESSNGHKHSPSER,ph,S,1211,true,"Tissue atlas Arabidopsis - ProteomicsDB",114,32188942,"MaxQuant score",169.7300000,0.9974200,,,,0,
NVGDATSVVSVPK,ph,S,1235,true,"Tissue atlas Arabidopsis - ProteomicsDB",114,32188942,"MaxQuant score",129.0100000,0.9022630,,,,6.484059849754E-5,
NVGDATSVVSVPKR,ph,S,1238,true,"Tissue atlas Arabidopsis - ProteomicsDB",114,32188942,"MaxQuant score",170.4800000,0.9991070,,,,7.8043201716112E-16,
NVGDATSVVSVPKR,ac,K,1241,true,"Quantitative Acetylproteomics",101,29440448,,,,,,,,
SSSGHSPYK,ph,S,1245,true,"atm and atr DNA damage response",88,25561503,"MASCOT Score",35.0000000,1.0000000,,,,,-0.6400000
SSSGHSPYKFSNSGPK,ph,S,1247,true,"Tissue atlas Arabidopsis - ProteomicsDB",114,32188942,"MaxQuant score",49.8650000,0.7848960,,,,0.0012160999467596,
SSSGHSPYK,ph,S,1247,true,"atm and atr DNA damage response",88,25561503,"MASCOT Score",35.0000000,0.9930000,,,,,-0.6400000
SSSGHSPYKFSNSGPK,ph,S,1250,true,"Tissue atlas Arabidopsis - ProteomicsDB",114,32188942,"MaxQuant score",152.1300000,0.9999810,,,,4.284619881112E-11,
SSSGHSPYK,ph,S,1250,true,"atm and atr DNA damage response",88,25561503,"MASCOT Score",54.0000000,0.9920000,,,,,1.0900000
VQLKASEDELHLESDMDK,ph,S,1266,true,"srk2dei ABA signaling phopshoproteomics",83,23572148,"MASCOT Score",51.0000000,,,,,,-0.0027000
VQLKASEDELHLESDMDK,ph,S,1266,true,"TOR Kinase and ABA Receptor",100,29290610,XCorr,3.4404790,1.0000000,,,,0.0044490001164377,
VQLKASEDELHLESDMDK,ph,S,1266,true,"Tissue atlas Arabidopsis - ProteomicsDB",114,32188942,"MaxQuant score",220.6900000,1.0000000,,,,0,
ASEDELHLESDMDK,ph,S,1266,true,"atm and atr DNA damage response",88,25561503,"MASCOT Score",31.0000000,1.0000000,,,,,-1.2800000
ASEDELHLESDMDKNVSLDSHDENSDQEK,ph,S,1274,true,"SnRK2 protein kinase substrates",85,23776212,XCorr,3.3960788,0.9040000,,,,6.8003202613909E-5,
VQLKASEDELHLESDMDK,ph,S,1274,true,"srk2dei ABA signaling phopshoproteomics",83,23572148,"MASCOT Score",51.0000000,,,,,,-0.0027000
VQLKASEDELHLESDMDK,ph,S,1274,true,"TOR Kinase and ABA Receptor",100,29290610,XCorr,3.4404790,1.0000000,,,,0.0044490001164377,
VQLKASEDELHLESDMDK,ph,S,1274,true,"Tissue atlas Arabidopsis - ProteomicsDB",114,32188942,"MaxQuant score",335.6200000,1.0000000,,,,0,
ASEDELHLESDMDK,ph,S,1274,true,"Large-scale phosphorylation discovery",44,23111157,XCorr,4.3880000,,,,,,
ASEDELHLESDMDK,ph,S,1274,true,"Tyrosine phosphorylation in Arabidopsis",59,18463617,"MASCOT Score",78.0000000,,,,,,-1.4137218
ASEDELHLESDMDK,ph,S,1274,true,"Chloroplast kinase substrates",60,19376835,"MASCOT Score",61.2400000,,,,,,-1.5914500
ASEDELHLESDMDK,ph,S,1274,true,"srk2dei ABA signaling phopshoproteomics",83,23572148,"MASCOT Score",87.0000000,,,,,,-0.0019000
ASEDELHLESDMDK,ph,S,1274,true,"LAXIC - mannitol vs control",84b,23660473,XCorr,4.7500000,1.0000000,,,,0.0088954996317625,
ASEDELHLESDMDK,ph,S,1274,true,"SnRK2 protein kinase substrates",85,23776212,XCorr,4.4708133,1.0000000,,,,6.8178698242605E-9,
ASEDELHLESDMDK,ph,S,1274,true,"atm and atr DNA damage response",88,25561503,"MASCOT Score",80.0000000,1.0000000,,,,,-0.2500000
ASEDELHLESDMDK,ph,S,1274,true,"TOR Kinase and ABA Receptor",100,29290610,XCorr,4.7215514,1.0000000,,,,1.5670000266255E-6,
ASEDELHLESDMDK,ph,S,1274,true,"Lateral root-induction - NAA vs control",106,23328941,"MASCOT Score",57.0000000,,,,,,
ASEDELHLESDMDK,ph,S,1274,true,"Phospho cell culture sucrose/TOR",109,30833711,,,1.0000000,,,,,
ASEDELHLESDMDKNVSLDSHDENSDQEK,ph,S,1281,true,"SnRK2 protein kinase substrates",85,23776212,XCorr,4.0742006,1.0000000,,,,0.0060529801994562,
NVSLDSHDENSDQEK,ph,S,1281,true,"LAXIC - mannitol vs control",84b,23660473,XCorr,5.0800000,1.0000000,,,,0.0008761310018599,
NVSLDSHDENSDQEK,ph,S,1281,true,"SnRK2 protein kinase substrates",85,23776212,XCorr,3.8637290,0.9830000,,,,0.011308999732137,
NVSLDSHDENSDQEK,ph,S,1281,true,"atm and atr DNA damage response",88,25561503,"MASCOT Score",25.0000000,1.0000000,,,,,0.1300000
NVSLDSHDENSDQEK,ph,S,1281,true,"TOR Kinase and ABA Receptor",100,29290610,XCorr,6.5575504,1.0000000,,,,3.9830001696828E-6,
NVSLDSHDENSDQEK,ph,S,1281,true,"Lateral root-induction - NAA vs control",106,23328941,"MASCOT Score",20.0000000,,,,,,
NVSLDSHDENSDQEK,ph,S,1281,true,"Tissue atlas Arabidopsis - ProteomicsDB",114,32188942,"MaxQuant score",268.4200000,1.0000000,,,,0,
ASEDELHLESDMDKNVSLDSHDENSDQEK,ph,S,1284,true,"SnRK2 protein kinase substrates",85,23776212,XCorr,4.0742006,1.0000000,,,,0.0060529801994562,
NVSLDSHDENSDQEK,ph,S,1284,true,"Tyrosine phosphorylation in Arabidopsis",59,18463617,"MASCOT Score",49.0000000,,,,,,-0.5012004
NVSLDSHDENSDQEK,ph,S,1284,true,"srk2dei ABA signaling phopshoproteomics",83,23572148,"MASCOT Score",27.0000000,,,,,,-0.0010000
NVSLDSHDENSDQEK,ph,S,1284,true,"LAXIC - mannitol vs control",84b,23660473,XCorr,5.0800000,1.0000000,,,,0.0008761310018599,
NVSLDSHDENSDQEK,ph,S,1284,true,"atm and atr DNA damage response",88,25561503,"MASCOT Score",32.0000000,0.9910000,,,,,0.6200000
NVSLDSHDENSDQEK,ph,S,1284,true,"TOR Kinase and ABA Receptor",100,29290610,XCorr,6.5575504,1.0000000,,,,3.9830001696828E-6,
NVSLDSHDENSDQEK,ph,S,1284,true,"Lateral root-induction - NAA vs control",106,23328941,"MASCOT Score",27.0000000,,,,,,
NVSLDSHDENSDQEK,ph,S,1284,true,"Phospho cell culture sucrose/TOR",109,30833711,,,0.9999980,,,,,
NVSLDSHDENSDQEK,ph,S,1284,true,"Tissue atlas Arabidopsis - ProteomicsDB",114,32188942,"MaxQuant score",308.9300000,1.0000000,,,,0,
ASEDELHLESDMDKNVSLDSHDENSDQEK,ph,S,1289,true,"SnRK2 protein kinase substrates",85,23776212,XCorr,4.2901077,0.9850000,,,,0.0065891398116946,
NVSLDSHDENSDQEK,ph,S,1289,true,"Tyrosine phosphorylation in Arabidopsis",59,18463617,"MASCOT Score",69.0000000,,,,,,-1.0580904
NVSLDSHDENSDQEK,ph,S,1289,true,"LAXIC - mannitol vs control",84b,23660473,XCorr,5.0800000,1.0000000,,,,0.0008761310018599,
NVSLDSHDENSDQEK,ph,S,1289,true,"SnRK2 protein kinase substrates",85,23776212,XCorr,4.8885779,1.0000000,,,,0.0013985499972478,
NVSLDSHDENSDQEK,ph,S,1289,true,"atm and atr DNA damage response",88,25561503,"MASCOT Score",45.0000000,1.0000000,,,,,-0.4200000
NVSLDSHDENSDQEK,ph,S,1289,true,"TOR Kinase and ABA Receptor",100,29290610,XCorr,6.5575504,1.0000000,,,,3.9830001696828E-6,
NVSLDSHDENSDQEK,ph,S,1289,true,"Lateral root-induction - NAA vs control",106,23328941,"MASCOT Score",53.0000000,,,,,,
NVSLDSHDENSDQEK,ph,S,1289,true,"Phospho cell culture sucrose/TOR",109,30833711,,,1.0000000,,,,,
NVSLDSHDENSDQEK,ph,S,1289,true,"Tissue atlas Arabidopsis - ProteomicsDB",114,32188942,"MaxQuant score",298.0700000,1.0000000,,,,0,
MLESISPRK,ph,S,1297,true,"srk2dei ABA signaling phopshoproteomics",83,23572148,"MASCOT Score",21.0000000,,,,,,-0.0003000
MLESISPR,ph,S,1297,true,"atm and atr DNA damage response",88,25561503,"MASCOT Score",35.0000000,1.0000000,,,,,-0.3100000
MLESISPR,ph,S,1297,true,"Lateral root-induction - NAA vs control",106,23328941,"MASCOT Score",23.0000000,,,,,,
MLESISPR,ph,S,1297,true,"Tissue atlas Arabidopsis - ProteomicsDB",114,32188942,"MaxQuant score",116.5500000,1.0000000,,,,0.0019440100295469,
MLESISPR,ph,S,1299,true,"Arabidopsis root NAA phosphoproteome",18a,27643528,"MaxQuant Score",61.9580000,0.9380000,,,,0.0020000000949949,-0.3040000
MLESISPR,ph,S,1299,true,"Chloroplast kinase substrates",60,19376835,"MASCOT Score",33.5700000,,,,,,0.0783109
MLESISPR,ph,S,1299,true,"srk2dei ABA signaling phopshoproteomics",83,23572148,"MASCOT Score",44.0000000,,,,,,0.0004000
MLESISPR,ph,S,1299,true,"SnRK2 protein kinase substrates",85,23776212,XCorr,2.1758633,1.0000000,,,,0.006291079800576,
MLESISPR,ph,S,1299,true,"atm and atr DNA damage response",88,25561503,"MASCOT Score",44.0000000,1.0000000,,,,,-0.3900000
MLESISPR,ph,S,1299,true,"TOR Kinase and ABA Receptor",100,29290610,XCorr,2.9303949,1.0000000,,,,0.0008139000274241,
MLESISPR,ph,S,1299,true,"Lateral root-induction - NAA vs control",106,23328941,"MASCOT Score",41.0000000,,,,,,
MLESISPR,ph,S,1299,true,"Tissue atlas Arabidopsis - ProteomicsDB",114,32188942,"MaxQuant score",158.7900000,1.0000000,,,,0.00039781900704838,
ITESDWALTDVER,ph,S,1316,true,"Tissue atlas Arabidopsis - ProteomicsDB",114,32188942,"MaxQuant score",252.2000000,1.0000000,,,,0,
ITESDWALTDVER,ph,T,1321,true,"Tissue atlas Arabidopsis - ProteomicsDB",114,32188942,"MaxQuant score",238.0700000,1.0000000,,,,0,
LVNDELIGCR,ox,C,1370,true,"SPEAR - 10 mM H2O2 / mock",138a,34619326,,,,2.0969466,0.0051246,YES,,
LVNDELIGCR,ox,C,1370,true,"SPEAR - 50 mM H2O2 / mock",138b,34619326,,,,1.7711859,0.0167220,YES,,
LVNDELIGCR,sno,C,1370,true,"hot5-4 / wildtype, FAT-switch S-nitrosoproteome",169,37277371,,,,0.3223343,0.3967176,NO,,
FYEGTVKSYDSTK,ac,K,1388,true,"Quantitative Acetylproteomics",101,29440448,,,,,,,,
EQWELIDTGGK,ph,T,1421,true,"Tissue atlas Arabidopsis - ProteomicsDB",114,32188942,"MaxQuant score",179.6700000,1.0000000,,,,1.4863399410998E-13,
EQWELIDTGGKTAK,ph,T,1425,true,"Tissue atlas Arabidopsis - ProteomicsDB",114,32188942,"MaxQuant score",109.8900000,0.9605700,,,,3.5313998523634E-5,
NPDGVQRDEDPVTTTPK,ph,T,1462,true,"srk2dei ABA signaling phopshoproteomics",83,23572148,"MASCOT Score",40.0000000,,,,,,0.0000000
NPDGVQRDEDPVTTTPK,ph,T,1462,true,"TOR Kinase and ABA Receptor",100,29290610,XCorr,4.1994238,0.9899000,,,,0.0013899999903515,
NPDGVQRDEDPVTTTPK,ph,T,1462,true,"Phospho cell culture sucrose/TOR",109,30833711,,,0.8872870,,,,,
NPDGVQRDEDPVTTTPK,ph,T,1462,true,"Tissue atlas Arabidopsis - ProteomicsDB",114,32188942,"MaxQuant score",150.6300000,0.9771740,,,,5.8882000837646E-13,
DEDPVTTTPK,ph,T,1462,true,"atm and atr DNA damage response",88,25561503,"MASCOT Score",46.0000000,0.9620000,,,,,-1.1200000
DEDPVTTTPKGKR,ub,K,1464,true,"Arabidopsis ubiquitination COFRADIC",40,26744219,"MaxQuant Score",49.2980000,0.8330000,,,,0.00080259999958798,0.0860000
SLSLEHEKVESR,ph,S,1484,true,"Tissue atlas Arabidopsis - ProteomicsDB",114,32188942,"MaxQuant score",123.4200000,1.0000000,,,,8.4938701547799E-6,
SLSLEHEKVESR,ph,S,1486,true,"atm and atr DNA damage response",88,25561503,"MASCOT Score",27.0000000,1.0000000,,,,,-0.7700000
SLSLEHEK,ph,S,1486,true,"atm and atr DNA damage response",88,25561503,"MASCOT Score",30.0000000,1.0000000,,,,,1.5900000
SLSLEHEK,ph,S,1486,true,"TOR Kinase and ABA Receptor",100,29290610,XCorr,2.1433654,0.9992000,,,,0.014419999904931,
SLSLEHEK,ph,S,1486,true,"Phospho cell culture sucrose/TOR",109,30833711,,,0.9999980,,,,,
SLSLEHEK,ph,S,1486,true,"Tissue atlas Arabidopsis - ProteomicsDB",114,32188942,"MaxQuant score",139.3800000,1.0000000,,,,9.6477797342231E-6,
SLSLEHEKVESR,ph,S,1494,true,"atm and atr DNA damage response",88,25561503,"MASCOT Score",43.0000000,1.0000000,,,,,0.1600000
SLSLEHEKVESR,ph,S,1494,true,"Tissue atlas Arabidopsis - ProteomicsDB",114,32188942,"MaxQuant score",87.8500000,0.9999990,,,,0.0001324500044575,
TEYSGEAGEEKSESEGK,ph,S,1510,true,"SnRK2 protein kinase substrates",85,23776212,XCorr,3.8418899,0.9820000,,,,0.0033305999822915,
TEYSGEAGEEKSESEGK,ph,S,1510,true,"Tissue atlas Arabidopsis - ProteomicsDB",114,32188942,"MaxQuant score",184.3200000,0.9999990,,,,4.9849600828541E-30,
TEYSGEAGEEK,ph,S,1510,true,"STN8 phosphoproteome",38,21768351,"MASCOT Score",56.9500000,,,,,,-0.7929700
TEYSGEAGEEK,ph,S,1510,true,"atm and atr DNA damage response",88,25561503,"MASCOT Score",63.0000000,0.9970000,,,,,0.1100000
TEYSGEAGEEK,ph,S,1510,true,"TOR Kinase and ABA Receptor",100,29290610,XCorr,3.4540143,0.9971000,,,,2.7860000045621E-5,
TEYSGEAGEEKSESEGK,ph,S,1518,true,"atm and atr DNA damage response",88,25561503,"MASCOT Score",35.0000000,0.9660000,,,,,-1.6200000
TEYSGEAGEEKSESEGK,ph,S,1518,true,"Tissue atlas Arabidopsis - ProteomicsDB",114,32188942,"MaxQuant score",337.0400000,1.0000000,,,,0,
TEYSGEAGEEKSESEGK,ph,S,1520,true,"Tissue atlas Arabidopsis - ProteomicsDB",114,32188942,"MaxQuant score",213.3200000,1.0000000,,,,0,
SLKEGEDDEEVVNKEEDLQEAK,ph,S,1524,true,"STN8 phosphoproteome",38,21768351,"MASCOT Score",68.9700000,,,,,,-1.6782600
SLKEGEDDEEVVNKEEDLQEAK,ph,S,1524,true,"Chloroplast kinase substrates",60,19376835,"MASCOT Score",59.5900000,,,,,,-1.6782600
SLKEGEDDEEVVNKEEDLQEAK,ph,S,1524,true,"TOR Kinase and ABA Receptor",100,29290610,XCorr,3.4379780,1.0000000,,,,0.019379999488592,
SLKEGEDDEEVVNKEEDLQEAK,ph,S,1524,true,"Tissue atlas Arabidopsis - ProteomicsDB",114,32188942,"MaxQuant score",143.0900000,1.0000000,,,,4.4231501432741E-33,
SLKEGEDDEEVVNK,ph,S,1524,true,"srk2dei ABA signaling phopshoproteomics",83,23572148,"MASCOT Score",65.0000000,,,,,,-0.0007000
SLKEGEDDEEVVNK,ph,S,1524,true,"TOR Kinase and ABA Receptor",100,29290610,XCorr,4.1601563,1.0000000,,,,0.00017339999612886,
EGEDDEEVVNKEEDLQEAKTESSGDAEGK,ph,T,1546,true,"TOR Kinase and ABA Receptor",100,29290610,XCorr,4.6922054,1.0000000,,,,0.0012420000275597,
EEDLQEAKTESSGDAEGK,ph,T,1546,true,"STN8 phosphoproteome",38,21768351,"MASCOT Score",47.0300000,,,,,,
EGEDDEEVVNKEEDLQEAKTESSGDAEGK,ph,S,1548,true,"Brassinosteroid-Regulated Phosphorylation Dynamics",94,26187819,"MaxQuant Score",68.8950000,0.9420000,,,,0.003000000026077,3.2180000
EGEDDEEVVNKEEDLQEAKTESSGDAEGK,ph,S,1548,true,"TOR Kinase and ABA Receptor",100,29290610,XCorr,4.6922054,1.0000000,,,,0.0012420000275597,
TESSGDAEGK,ph,S,1548,true,"SnRK2 protein kinase substrates",85,23776212,XCorr,2.0764797,0.9970000,,,,0.038017500191927,
TESSGDAEGK,ph,S,1548,true,"atm and atr DNA damage response",88,25561503,"MASCOT Score",65.0000000,1.0000000,,,,,-0.7300000
EGEDDEEVVNKEEDLQEAKTESSGDAEGK,ph,S,1549,true,"Brassinosteroid-Regulated Phosphorylation Dynamics",94,26187819,"MaxQuant Score",68.8950000,0.9560000,,,,0.003000000026077,2.8340000
EGEDDEEVVNKEEDLQEAKTESSGDAEGK,ph,S,1549,true,"TOR Kinase and ABA Receptor",100,29290610,XCorr,4.6922054,1.0000000,,,,0.0012420000275597,
EAEHDDSDTEGKQENNEMEREAEENAETSDNETLGAWK,ph,S,1562,true,"Brassinosteroid-Regulated Phosphorylation Dynamics",94,26187819,"MaxQuant Score",57.0200000,0.7540000,,,,0.0049999998882413,-1.5560000
EAEHDDSDTEGKQENNEMER,ph,S,1562,true,"STN8 phosphoproteome",38,21768351,"MASCOT Score",60.8400000,,,,,,
EAEHDDSDTEGKQENNEMER,ph,S,1562,true,"Tyrosine phosphorylation in Arabidopsis",59,18463617,"MASCOT Score",40.0000000,,,,,,-0.8190379
EAEHDDSDTEGKQENNEMER,ph,S,1562,true,"Chloroplast kinase substrates",60,19376835,"MASCOT Score",33.3900000,,,,,,-0.5505750
EAEHDDSDTEGKQENNEMER,ph,S,1562,true,"LAXIC - mannitol vs control",84b,23660473,XCorr,3.1100000,0.8280000,,,,0.00017620800645091,
EAEHDDSDTEGKQENNEMER,ph,S,1562,true,"SnRK2 protein kinase substrates",85,23776212,XCorr,3.7128463,0.8640000,,,,4.7829298637225E-6,
EAEHDDSDTEGKQENNEMER,ph,S,1562,true,"atm and atr DNA damage response",88,25561503,"MASCOT Score",40.0000000,1.0000000,,,,,0.2100000
EAEHDDSDTEGKQENNEMER,ph,S,1562,true,"TOR Kinase and ABA Receptor",100,29290610,XCorr,4.0675411,0.8803000,,,,0.00073039997369051,
EAEHDDSDTEGK,ph,S,1562,true,"atm and atr DNA damage response",88,25561503,"MASCOT Score",59.0000000,0.9970000,,,,,0.5100000
EAEHDDSDTEGKQENNEMER,ph,T,1564,true,"TOR Kinase and ABA Receptor",100,29290610,XCorr,2.6036828,1.0000000,,,,0.0020979999098927,
EAEHDDSDTEGKQENNEMEREAEENAETSDNETLGAWK,ph,T,1583,true,"TOR Kinase and ABA Receptor",100,29290610,XCorr,3.7523091,0.9431000,,,,0.034430000931025,
EAEENAETSDNETLGAWK,ph,T,1583,true,"srk2dei ABA signaling phopshoproteomics",83,23572148,"MASCOT Score",34.0000000,,,,,,0.0000000
EAEENAETSDNETLGAWK,ph,T,1583,true,"Lateral root-induction - NAA vs control",106,23328941,"MASCOT Score",25.0000000,,,,,,
EAEENAETSDNETLGAWK,ph,T,1583,true,"Tissue atlas Arabidopsis - ProteomicsDB",114,32188942,"MaxQuant score",234.5700000,0.9999910,,,,0,
EAEHDDSDTEGKQENNEMEREAEENAETSDNETLGAWK,ph,S,1584,true,"Brassinosteroid-Regulated Phosphorylation Dynamics",94,26187819,"MaxQuant Score",57.0200000,0.7550000,,,,0.0049999998882413,-2.1160000
EAEHDDSDTEGKQENNEMEREAEENAETSDNETLGAWK,ph,S,1584,true,"TOR Kinase and ABA Receptor",100,29290610,XCorr,3.7523091,0.9506000,,,,0.034430000931025,
QENNEMEREAEENAETSDNETLGAWK,ph,S,1584,true,"TOR Kinase and ABA Receptor",100,29290610,XCorr,5.0316930,0.8350000,,,,0.00038829998811707,
EAEENAETSDNETLGAWKSK,ph,S,1584,true,"Chloroplast kinase substrates",60,19376835,"MASCOT Score",40.2200000,,,,,,-1.0475500
EAEENAETSDNETLGAWK,ph,S,1584,true,"Large-scale phosphorylation discovery",44,23111157,XCorr,4.1960000,,,,,,
EAEENAETSDNETLGAWK,ph,S,1584,true,"Tyrosine phosphorylation in Arabidopsis",59,18463617,"MASCOT Score",55.0000000,,,,,,-0.9648696
EAEENAETSDNETLGAWK,ph,S,1584,true,"BSK8 and BSL2 regulating sucrose-ph synthase",66,24924143,"MaxQuant Score",130.3700000,,,,,,-0.4139600
EAEENAETSDNETLGAWK,ph,S,1584,true,"srk2dei ABA signaling phopshoproteomics",83,23572148,"MASCOT Score",74.0000000,,,,,,-0.0017000
EAEENAETSDNETLGAWK,ph,S,1584,true,"LAXIC - ABA stress",84a,23660473,XCorr,5.2600000,0.9960000,,,,6.4400000887588E-9,
EAEENAETSDNETLGAWK,ph,S,1584,true,"LAXIC - mannitol vs control",84b,23660473,XCorr,4.7100000,0.9970000,,,,1.0499999916647E-5,
EAEENAETSDNETLGAWK,ph,S,1584,true,"SnRK2 protein kinase substrates",85,23776212,XCorr,4.4820385,0.9980000,,,,4.5742701293428E-11,
EAEENAETSDNETLGAWK,ph,S,1584,true,"atm and atr DNA damage response",88,25561503,"MASCOT Score",72.0000000,0.9340000,,,,,-0.5900000
EAEENAETSDNETLGAWK,ph,S,1584,true,"TOR Kinase and ABA Receptor",100,29290610,XCorr,5.3446522,0.9779000,,,,2.890000061484E-8,
EAEENAETSDNETLGAWK,ph,S,1584,true,"Lateral root-induction - NAA vs control",106,23328941,"MASCOT Score",56.0000000,,0.0441316,0.9235834,NO,,
EAEENAETSDNETLGAWK,ph,S,1584,true,"Phospho cell culture sucrose/TOR",109,30833711,,,0.9988050,,,,,
EAEENAETSDNETLGAWK,ph,S,1584,true,"Col-0 callus - FC Col-0 vs. Col-0 Xray",111a,31410901,,45.0700000,,-0.3644628,0.0000000,NO,,0.6485450
EAEENAETSDNETLGAWK,ph,S,1584,true,"Col-0 X-ray callus - FC Col-0 vs. Col-0 Xray",111b,31410901,,45.0700000,,-0.3644628,0.0000000,NO,,0.6485450
EAEENAETSDNETLGAWK,ph,S,1584,true,"atm callus - FC atm vs. atm Xray",111c,31410901,,45.0700000,,-0.9987436,0.0000000,NO,,0.6485450
EAEENAETSDNETLGAWK,ph,S,1584,true,"atm-3 X-ray callus - FC atm vs. atm Xray",111d,31410901,,45.0700000,,-0.9987436,0.0000000,NO,,0.6485450
EAEENAETSDNETLGAWK,ph,S,1584,true,"Tissue atlas Arabidopsis - ProteomicsDB",114,32188942,"MaxQuant score",358.1200000,0.9996600,,,,0,
EAEENAETSDNETLGAWK,ph,S,1584,true,"Touch-induced phosphorylation: 40s touch vs untouc",136,30291188,"MASCOT score",98.9500000,,-0.0414195,0.2162123,NO,,-1.4114051
EAEENAETSDNETLGAWK,ph,T,1588,true,"STN8 phosphoproteome",38,21768351,"MASCOT Score",52.4200000,,,,,,-0.7988020
EAEENAETSDNETLGAWK,ph,T,1588,true,"Tyrosine phosphorylation in Arabidopsis",59,18463617,"MASCOT Score",22.0000000,,,,,,-0.7236520
EAEENAETSDNETLGAWK,ph,T,1588,true,"BSK8 and BSL2 regulating sucrose-ph synthase",66,24924143,"MaxQuant Score",108.2500000,,,,,,0.0416520
EAEENAETSDNETLGAWK,ph,T,1588,true,"srk2dei ABA signaling phopshoproteomics",83,23572148,"MASCOT Score",54.0000000,,,,,,-0.0003000
EAEENAETSDNETLGAWK,ph,T,1588,true,"Tissue atlas Arabidopsis - ProteomicsDB",114,32188942,"MaxQuant score",93.1620000,0.8347920,,,,0.00013441700139083,
VGKSISR,ac,K,1598,true,"Quantitative Acetylproteomics",101,29440448,,,,,,,,
