Peptide,PTM,ModifiedAA,ModifiedPosition,PeptideUniqueToGene,ExperimentDesc,ExpID,PubmedID,ScoreType,IdentScore,LocProb,Log2FChange,PQ-val,QuantSig,PEP,MassErrorPPM
FTSEAAADGGQDQILSR,nt,F,38,true,"Mitochondrial intermediate peptidases - icp55 / WT",131a,25732537,,124.1000000,,6.6438562,,,,
FTSEAAADGGQDQILSR,nt,F,38,true,"Mitochondrial intermediate peptidases - oct1-1 / WT",131b,25732537,,106.3700000,,-0.1782826,,,,
FTSEAAADGGQDQILSR,nt,F,38,true,"Mitochondrial intermediate peptidases - oct1-2 / WT",131c,25732537,,96.8200000,,-1.5828343,,,,
TSEAAADGGQDQILSRVIELVKKY,nt,T,39,true,"Arabidopsis translation initiation landscape - NT",167b,35069635,,,,,,,,
TSEAAADGGQDQILSR,nt,T,39,true,"Arg/N-end rule pathway Roots",80,25728785,"MASCOT Score",119.6900000,,,,,5.7549999610274E-7,
TSEAAADGGQDQILSR,nt,T,39,true,"Tic56 chloroplast import - wild-type",89a,25588737,XCorr,3.8741646,,,,,,
TSEAAADGGQDQILSR,nt,T,39,true,"Tic56 chloroplast import - ppi2",89b,25588737,XCorr,4.0216227,,,,,,
TSEAAADGGQDQILSR,nt,T,39,true,"Tic56 chloroplast import - tic56-1",89c,25588737,XCorr,4.0795398,,,,,,
TSEAAADGGQDQILSR,nt,T,39,true,"Arg/N-end rule seed, prt6 vs. Wt",99,29168982,"MASCOT Score",96.0000000,,-0.3835785,0.1279627,NO,0.00017699999443721,-0.8320272
TSEAAADGGQDQILSR,nt,T,39,true,"Mitochondrial intermediate peptidases - icp55 / WT",131a,25732537,,135.7600000,,-3.1814964,,,,
TSEAAADGGQDQILSR,nt,T,39,true,"Mitochondrial intermediate peptidases - oct1-1 / WT",131b,25732537,,129.5700000,,-0.4150744,,,,
TSEAAADGGQDQILSR,nt,T,39,true,"Mitochondrial intermediate peptidases - oct1-2 / WT",131c,25732537,,126.3500000,,-0.8100935,,,,
TSEAAADGGQDQILSR,nta,T,39,true,"FtsH12 N-terminome: WT / FtsH12 knockdown miRNA",118,33216923,"MaxQuant score",48.4230000,,,,,0.029527999460697,
SEAAADGGQDQILSR,nt,S,40,true,"Tic56 chloroplast import - tic56-1",89c,25588737,XCorr,4.1057625,,,,,,
SEAAADGGQDQILSR,nt,S,40,true,"Arg/N-end rule seed, prt6 vs. Wt",99,29168982,"MASCOT Score",103.6500000,,-0.8416060,0.0587217,NO,0.00012280000373721,-1.5024600
SEAAADGGQDQILSR,nt,S,40,true,"Mitochondrial intermediate peptidases - icp55 / WT",131a,25732537,,126.8800000,,-6.6438562,,,,
SEAAADGGQDQILSR,nt,S,40,true,"Mitochondrial intermediate peptidases - oct1-1 / WT",131b,25732537,,128.0100000,,-0.5739868,,,,
SEAAADGGQDQILSR,nt,S,40,true,"Mitochondrial intermediate peptidases - oct1-2 / WT",131c,25732537,,133.4700000,,-1.0546959,,,,
SEAAADGGQDQILSR,nt,S,40,true,"Arabidopsis translation initiation landscape - NT",167b,35069635,,,,,,,,
