Peptide,PTM,ModifiedAA,ModifiedPosition,PeptideUniqueToGene,ExperimentDesc,ExpID,PubmedID,ScoreType,IdentScore,LocProb,Log2FChange,PQ-val,QuantSig,PEP,MassErrorPPM
AIYYKFKSAR,nta,A,2,false,"Arabidopsis translation initiation landscape - NTA",167a,35069635,,,,,,,,
EMEGLPSTTR,ph,S,281,true,"Tissue atlas Arabidopsis - ProteomicsDB",114,32188942,"MaxQuant score",130.5600000,0.8782480,,,,2.7957899874309E-5,
SVGELPPELK,ph,S,285,true,"Tyrosine phosphorylation in Arabidopsis",59,18463617,"MASCOT Score",28.0000000,,,,,,-1.5685579
SVGELPPELK,ph,S,285,true,"Conserved plant phosphoproteome - Arabidopsis",61a,20466843,"MASCOT Score",28.0000000,1.0000000,,,,,
SVGELPPELK,ph,S,285,true,"srk2dei ABA signaling phopshoproteomics",83,23572148,"MASCOT Score",25.0000000,,,,,,-0.0003000
SVGELPPELK,ph,S,285,true,"atm and atr DNA damage response",88,25561503,"MASCOT Score",55.0000000,1.0000000,,,,,-0.5000000
SVGELPPELK,ph,S,285,true,"Phospho cell culture sucrose/TOR",109,30833711,,,1.0000000,,,,,
SVGELPPELK,ph,S,285,true,"Tissue atlas Arabidopsis - ProteomicsDB",114,32188942,"MaxQuant score",123.0100000,1.0000000,,,,0.00011461700341897,
ILEAGNDSTENVGSVGHIPDLESAR,ph,S,363,true,"srk2dei ABA signaling phopshoproteomics",83,23572148,"MASCOT Score",63.0000000,,,,,,-0.0002000
ILEAGNDSTENVGSVGHIPDLESAR,ph,S,363,true,"LAXIC - ABA stress",84a,23660473,XCorr,4.0500000,0.8750000,,,,0.00016542800585739,
ILEAGNDSTENVGSVGHIPDLESAR,ph,S,363,true,"LAXIC - mannitol vs control",84b,23660473,XCorr,6.0000000,0.8790000,,,,6.9000001531094E-5,
ILEAGNDSTENVGSVGHIPDLESAR,ph,S,363,true,"SnRK2 protein kinase substrates",85,23776212,XCorr,4.2072096,0.8900000,,,,4.8113199351257E-15,
ILEAGNDSTENVGSVGHIPDLESAR,ph,S,363,true,"TOR Kinase and ABA Receptor",100,29290610,XCorr,5.1485043,0.8821000,,,,6.6609999294087E-8,
ILEAGNDSTENVGSVGHIPDLESAR,ph,S,363,true,"Lateral root-induction - NAA vs control",106,23328941,"MASCOT Score",37.0000000,,,,,,
ILEAGNDSTENVGSVGHIPDLESAR,ph,S,363,true,"Phospho cell culture sucrose/TOR",109,30833711,,,0.9999150,,,,,
ILEAGNDSTENVGSVGHIPDLESAR,ph,S,363,true,"Col-0 callus - FC Col-0 vs. Col-0 Xray",111a,31410901,,34.1000000,,1.3256138,0.0000000,NO,,0.5760947
ILEAGNDSTENVGSVGHIPDLESAR,ph,S,363,true,"Col-0 X-ray callus - FC Col-0 vs. Col-0 Xray",111b,31410901,,34.1000000,,1.3256138,0.0000000,NO,,0.5760947
ILEAGNDSTENVGSVGHIPDLESAR,ph,S,363,true,"atm callus - FC atm vs. atm Xray",111c,31410901,,34.1000000,,0.8469926,0.0000000,NO,,0.5760947
ILEAGNDSTENVGSVGHIPDLESAR,ph,S,363,true,"atm-3 X-ray callus - FC atm vs. atm Xray",111d,31410901,,34.1000000,,0.8469926,0.0000000,NO,,0.5760947
ILEAGNDSTENVGSVGHIPDLESAR,ph,S,363,true,"Tissue atlas Arabidopsis - ProteomicsDB",114,32188942,"MaxQuant score",247.6200000,1.0000000,,,,0,
ILEAGNDSTENVGSVGHIPDLESAR,ph,T,364,true,"srk2dei ABA signaling phopshoproteomics",83,23572148,"MASCOT Score",53.0000000,,,,,,0.0010000
ILEAGNDSTENVGSVGHIPDLESAR,ph,T,364,true,"LAXIC - ABA stress",84a,23660473,XCorr,4.0500000,0.8750000,,,,0.00016542800585739,
ILEAGNDSTENVGSVGHIPDLESAR,ph,T,364,true,"LAXIC - mannitol vs control",84b,23660473,XCorr,3.2500000,0.7640000,,,,0.00030705900280736,
ILEAGNDSTENVGSVGHIPDLESAR,ph,T,364,true,"Col-0 callus - FC Col-0 vs. Col-0 Xray",111a,31410901,,37.3400000,,0.7576077,0.0000000,NO,,1.0731162
ILEAGNDSTENVGSVGHIPDLESAR,ph,T,364,true,"Col-0 X-ray callus - FC Col-0 vs. Col-0 Xray",111b,31410901,,37.3400000,,0.7576077,0.0000000,NO,,1.0731162
ILEAGNDSTENVGSVGHIPDLESAR,ph,T,364,true,"atm callus - FC atm vs. atm Xray",111c,31410901,,37.3400000,,0.5986856,0.0000000,NO,,1.0731162
ILEAGNDSTENVGSVGHIPDLESAR,ph,T,364,true,"atm-3 X-ray callus - FC atm vs. atm Xray",111d,31410901,,37.3400000,,0.5986856,0.0000000,NO,,1.0731162
ILEAGNDSTENVGSVGHIPDLESAR,ph,T,364,true,"Tissue atlas Arabidopsis - ProteomicsDB",114,32188942,"MaxQuant score",129.4800000,1.0000000,,,,2.259590085015E-28,
ILEAGNDSTENVGSVGHIPDLESAR,ph,S,369,true,"srk2dei ABA signaling phopshoproteomics",83,23572148,"MASCOT Score",63.0000000,,,,,,-0.0002000
ILEAGNDSTENVGSVGHIPDLESAR,ph,S,369,true,"LAXIC - mannitol vs control",84b,23660473,XCorr,6.0000000,0.9960000,,,,6.9000001531094E-5,
ILEAGNDSTENVGSVGHIPDLESAR,ph,S,369,true,"SnRK2 protein kinase substrates",85,23776212,XCorr,4.2072096,0.9970000,,,,4.8113199351257E-15,
ILEAGNDSTENVGSVGHIPDLESAR,ph,S,369,true,"Brassinosteroid-Regulated Phosphorylation Dynamics",94,26187819,"MaxQuant Score",40.4630000,0.9850000,,,,0.041999999433756,0.4230000
ILEAGNDSTENVGSVGHIPDLESAR,ph,S,369,true,"TOR Kinase and ABA Receptor",100,29290610,XCorr,5.1485043,1.0000000,,,,6.6609999294087E-8,
ILEAGNDSTENVGSVGHIPDLESAR,ph,S,369,true,"Lateral root-induction - NAA vs control",106,23328941,"MASCOT Score",24.0000000,,,,,,
ILEAGNDSTENVGSVGHIPDLESAR,ph,S,369,true,"Col-0 callus - FC Col-0 vs. Col-0 Xray",111a,31410901,,37.3400000,,0.7576077,0.0000000,NO,,1.0731162
ILEAGNDSTENVGSVGHIPDLESAR,ph,S,369,true,"Col-0 X-ray callus - FC Col-0 vs. Col-0 Xray",111b,31410901,,37.3400000,,0.7576077,0.0000000,NO,,1.0731162
ILEAGNDSTENVGSVGHIPDLESAR,ph,S,369,true,"atm callus - FC atm vs. atm Xray",111c,31410901,,37.3400000,,0.5986856,0.0000000,NO,,1.0731162
ILEAGNDSTENVGSVGHIPDLESAR,ph,S,369,true,"atm-3 X-ray callus - FC atm vs. atm Xray",111d,31410901,,37.3400000,,0.5986856,0.0000000,NO,,1.0731162
ILEAGNDSTENVGSVGHIPDLESAR,ph,S,369,true,"Tissue atlas Arabidopsis - ProteomicsDB",114,32188942,"MaxQuant score",229.2800000,0.9999990,,,,0,
ALSPTTSVASKGEK,ph,S,388,true,"LAXIC - mannitol vs control",84b,23660473,XCorr,2.7800000,0.9990000,,,,0.13559499382973,
ALSPTTSVASKGEK,ph,S,388,true,"SnRK2 protein kinase substrates",85,23776212,XCorr,2.4477623,0.9990000,,,,0.020174199715257,
ALSPTTSVASKGEK,ph,S,388,true,"atm and atr DNA damage response",88,25561503,"MASCOT Score",38.0000000,1.0000000,,,,,-0.9300000
ALSPTTSVASKGEK,ph,S,388,true,"Col-0 callus - FC Col-0 vs. Col-0 Xray",111a,31410901,,27.7700000,,0.5147733,0.0000000,NO,,0.8281024
ALSPTTSVASKGEK,ph,S,388,true,"Col-0 X-ray callus - FC Col-0 vs. Col-0 Xray",111b,31410901,,27.7700000,,0.5147733,0.0000000,NO,,0.8281024
ALSPTTSVASKGEK,ph,S,388,true,"atm callus - FC atm vs. atm Xray",111c,31410901,,27.7700000,,0.8178543,0.0000000,NO,,0.8281024
ALSPTTSVASKGEK,ph,S,388,true,"atm-3 X-ray callus - FC atm vs. atm Xray",111d,31410901,,27.7700000,,0.8178543,0.0000000,NO,,0.8281024
ALSPTTSVASKGEK,ph,S,388,true,"Tissue atlas Arabidopsis - ProteomicsDB",114,32188942,"MaxQuant score",182.4900000,0.9999990,,,,7.3503301290769E-23,
ALSPTTSVASK,ph,S,388,true,"Tyrosine phosphorylation in Arabidopsis",59,18463617,"MASCOT Score",38.0000000,,,,,,-0.5260657
ALSPTTSVASK,ph,S,388,true,"LAXIC - mannitol vs control",84b,23660473,XCorr,2.4200000,0.9350000,-1.0992207,,NO,0.00031558400951326,
ALSPTTSVASK,ph,S,388,true,"atm and atr DNA damage response",88,25561503,"MASCOT Score",68.0000000,1.0000000,,,,,-0.5900000
ALSPTTSVASK,ph,S,388,true,"Protein sumoylation and phosphorylation cross-talk",97,28419593,,,,,,,,
ALSPTTSVASK,ph,S,388,true,"TOR Kinase and ABA Receptor",100,29290610,XCorr,2.5511293,0.9795000,,,,0.0095389997586608,
ALSPTTSVASK,ph,S,388,true,"Lateral root-induction - NAA vs control",106,23328941,"MASCOT Score",37.0000000,,,,,,
ALSPTTSVASK,ph,S,388,true,"Phospho cell culture sucrose/TOR",109,30833711,,,0.9999170,,,,,
ALSPTTSVASK,ph,T,390,true,"atm and atr DNA damage response",88,25561503,"MASCOT Score",35.0000000,0.9660000,,,,,0.1100000
ALSPTTSVASK,ph,T,391,true,"atm and atr DNA damage response",88,25561503,"MASCOT Score",33.0000000,0.9900000,,,,,-0.2700000
ALSPTTSVASKGEK,ph,S,392,true,"LAXIC - mannitol vs control",84b,23660473,XCorr,2.2500000,0.8140000,,,,0.012263599783182,
ALSPTTSVASKGEK,ph,S,392,true,"Phospho cell culture sucrose/TOR",109,30833711,,,0.9977780,,,,,
ALSPTTSVASKGEK,ph,S,392,true,"Col-0 callus - FC Col-0 vs. Col-0 Xray",111a,31410901,,27.7700000,,0.5147733,0.0000000,NO,,0.8281024
ALSPTTSVASKGEK,ph,S,392,true,"Col-0 X-ray callus - FC Col-0 vs. Col-0 Xray",111b,31410901,,27.7700000,,0.5147733,0.0000000,NO,,0.8281024
ALSPTTSVASKGEK,ph,S,392,true,"atm callus - FC atm vs. atm Xray",111c,31410901,,27.7700000,,0.8178543,0.0000000,NO,,0.8281024
ALSPTTSVASKGEK,ph,S,392,true,"atm-3 X-ray callus - FC atm vs. atm Xray",111d,31410901,,27.7700000,,0.8178543,0.0000000,NO,,0.8281024
ALSPTTSVASKGEK,ph,S,392,true,"Tissue atlas Arabidopsis - ProteomicsDB",114,32188942,"MaxQuant score",155.0000000,0.9974310,,,,4.1746200940551E-10,
ALSPTTSVASK,ph,S,392,true,"atm and atr DNA damage response",88,25561503,"MASCOT Score",33.0000000,0.9900000,,,,,-0.2700000
ALSPTTSVASKGEK,ph,S,395,true,"LAXIC - mannitol vs control",84b,23660473,XCorr,2.7800000,0.9210000,,,,0.13559499382973,
ALSPTTSVASKGEK,ph,S,395,true,"SnRK2 protein kinase substrates",85,23776212,XCorr,2.4477623,0.9210000,,,,0.020174199715257,
ALSPTTSVASKGEK,ph,S,395,true,"atm and atr DNA damage response",88,25561503,"MASCOT Score",38.0000000,1.0000000,,,,,-0.9300000
ALSPTTSVASKGEK,ph,S,395,true,"Phospho cell culture sucrose/TOR",109,30833711,,,0.9999750,,,,,
ALSPTTSVASKGEK,ph,S,395,true,"Col-0 callus - FC Col-0 vs. Col-0 Xray",111a,31410901,,27.7700000,,0.5147733,0.0000000,NO,,0.8281024
ALSPTTSVASKGEK,ph,S,395,true,"Col-0 X-ray callus - FC Col-0 vs. Col-0 Xray",111b,31410901,,27.7700000,,0.5147733,0.0000000,NO,,0.8281024
ALSPTTSVASKGEK,ph,S,395,true,"atm callus - FC atm vs. atm Xray",111c,31410901,,27.7700000,,0.8178543,0.0000000,NO,,0.8281024
ALSPTTSVASKGEK,ph,S,395,true,"atm-3 X-ray callus - FC atm vs. atm Xray",111d,31410901,,27.7700000,,0.8178543,0.0000000,NO,,0.8281024
ALSPTTSVASKGEK,ph,S,395,true,"Tissue atlas Arabidopsis - ProteomicsDB",114,32188942,"MaxQuant score",182.4900000,1.0000000,,,,7.3503301290769E-23,
ALSPTTSVASK,ph,S,395,true,"LAXIC - mannitol vs control",84b,23660473,XCorr,2.4200000,0.9520000,-1.0992207,,NO,0.00031558400951326,
ALSPTTSVASK,ph,S,395,true,"atm and atr DNA damage response",88,25561503,"MASCOT Score",68.0000000,0.9900000,,,,,-0.5900000
KPVLSNNNDASTLKAPMEVAEITSAPR,ph,S,404,true,"Tissue atlas Arabidopsis - ProteomicsDB",114,32188942,"MaxQuant score",247.6100000,1.0000000,,,,0,
KPVLSNNNDASTLK,ph,S,404,true,"Phosphorylation nuclei-enriched fractions",28,19245862,,,,,,,,
KPVLSNNNDASTLK,ph,S,404,true,"Phosphoproteome iron-deficient Arabidopsis roots",41,22438062,"MASCOT Score",59.0400000,,,,,,
KPVLSNNNDASTLK,ph,S,404,true,"Tyrosine phosphorylation in Arabidopsis",59,18463617,"MASCOT Score",44.0000000,,,,,,-1.0128127
KPVLSNNNDASTLK,ph,S,404,true,"srk2dei ABA signaling phopshoproteomics",83,23572148,"MASCOT Score",39.0000000,,,,,,-0.0007000
KPVLSNNNDASTLK,ph,S,404,true,"LAXIC - ABA stress",84a,23660473,XCorr,3.6200000,0.9900000,,,,0.034654598683119,
KPVLSNNNDASTLK,ph,S,404,true,"LAXIC - mannitol vs control",84b,23660473,XCorr,3.6400000,1.0000000,-1.4788649,,NO,1.4000000192027E-5,
KPVLSNNNDASTLK,ph,S,404,true,"SnRK2 protein kinase substrates",85,23776212,XCorr,3.1988764,1.0000000,,,,0.00039005099097267,
KPVLSNNNDASTLK,ph,S,404,true,"atm and atr DNA damage response",88,25561503,"MASCOT Score",75.0000000,1.0000000,,,,,1.3100000
KPVLSNNNDASTLK,ph,S,404,true,"Protein sumoylation and phosphorylation cross-talk",97,28419593,,,,,,,,
KPVLSNNNDASTLK,ph,S,404,true,"TOR Kinase and ABA Receptor",100,29290610,XCorr,4.2691183,1.0000000,,,,0.00030310000875033,
KPVLSNNNDASTLK,ph,S,404,true,"Lateral root-induction - NAA vs control",106,23328941,"MASCOT Score",50.0000000,,,,,,
KPVLSNNNDASTLK,ph,S,404,true,"Phospho cell culture sucrose/TOR",109,30833711,,,0.9999940,,,,,
KPVLSNNNDASTLK,ph,S,404,true,"Col-0 callus - FC Col-0 vs. Col-0 Xray",111a,31410901,,63.5900000,,0.5115729,0.0000000,NO,,0.7453197
KPVLSNNNDASTLK,ph,S,404,true,"Col-0 X-ray callus - FC Col-0 vs. Col-0 Xray",111b,31410901,,63.5900000,,0.5115729,0.0000000,NO,,0.7453197
KPVLSNNNDASTLK,ph,S,404,true,"atm callus - FC atm vs. atm Xray",111c,31410901,,63.5900000,,-0.0227144,0.0000000,NO,,0.7453197
KPVLSNNNDASTLK,ph,S,404,true,"atm-3 X-ray callus - FC atm vs. atm Xray",111d,31410901,,63.5900000,,-0.0227144,0.0000000,NO,,0.7453197
KPVLSNNNDASTLK,ph,T,411,true,"srk2dei ABA signaling phopshoproteomics",83,23572148,"MASCOT Score",26.0000000,,,,,,-0.0011000
ASAEVNVEKPVDACESTQGSVIVK,ph,S,428,true,"Tissue atlas Arabidopsis - ProteomicsDB",114,32188942,"MaxQuant score",66.3780000,0.9999960,,,,4.9681898417475E-6,
MMMNNGTSASASSINPNK,ph,S,656,true,"Tissue atlas Arabidopsis - ProteomicsDB",114,32188942,"MaxQuant score",146.8100000,0.9550720,,,,1.9682899566465E-35,
RLSPEHPPTRK,ph,S,687,true,"srk2dei ABA signaling phopshoproteomics",83,23572148,"MASCOT Score",24.0000000,,,,,,-0.0002000
RLSPEHPPTRK,ph,S,687,true,"TOR Kinase and ABA Receptor",100,29290610,XCorr,2.2938335,1.0000000,,,,0.076640002429485,
RLSPEHPPTR,ph,S,687,true,"srk2dei ABA signaling phopshoproteomics",83,23572148,"MASCOT Score",33.0000000,,,,,,-0.0004000
RLSPEHPPTR,ph,S,687,true,"LAXIC - mannitol vs control",84b,23660473,XCorr,2.6700000,0.9970000,,,,0.0026642100419849,
RLSPEHPPTR,ph,S,687,true,"SnRK2 protein kinase substrates",85,23776212,XCorr,2.2478857,1.0000000,,,,0.0092200897634029,
RLSPEHPPTR,ph,S,687,true,"atm and atr DNA damage response",88,25561503,"MASCOT Score",27.0000000,1.0000000,,,,,-0.0700000
RLSPEHPPTR,ph,S,687,true,"TOR Kinase and ABA Receptor",100,29290610,XCorr,3.4315305,1.0000000,,,,0.00021169999672566,
RLSPEHPPTR,ph,S,687,true,"Tissue atlas Arabidopsis - ProteomicsDB",114,32188942,"MaxQuant score",115.6300000,1.0000000,,,,3.601150092436E-5,
NISPSRDSK,ph,S,698,true,"STN8 phosphoproteome",38,21768351,"MASCOT Score",43.9800000,,,,,,-0.2908120
NISPSRDSK,ph,S,698,true,"Chloroplast kinase substrates",60,19376835,"MASCOT Score",32.6300000,,,,,,-0.2908120
KNISPSR,ph,S,698,true,"Tissue atlas Arabidopsis - ProteomicsDB",114,32188942,"MaxQuant score",86.8820000,0.9913320,,,,0.015937000513077,
KRSEPPSSEPPVPATK,ph,S,765,true,"atm and atr DNA damage response",88,25561503,"MASCOT Score",45.0000000,0.9940000,,,,,-0.2200000
KRSEPPSSEPPVPATK,ph,S,765,true,"TOR Kinase and ABA Receptor",100,29290610,XCorr,3.7810285,0.9996000,,,,0.00049499998567626,
KRSEPPSSEPPVPATK,ph,S,765,true,"Tissue atlas Arabidopsis - ProteomicsDB",114,32188942,"MaxQuant score",171.9000000,1.0000000,,,,8.6503498232287E-20,
SEPPSSEPPVPATK,ph,S,769,true,"Tissue atlas Arabidopsis - ProteomicsDB",114,32188942,"MaxQuant score",176.0000000,0.9996580,,,,2.4792400256249E-16,
ISFPEEETSSGK,ph,T,800,true,"Tissue atlas Arabidopsis - ProteomicsDB",114,32188942,"MaxQuant score",101.7800000,0.7581620,,,,5.208799848333E-5,
EIEVADYESSDEDRHFK,ph,Y,847,true,"Brassinosteroid-Regulated Phosphorylation Dynamics",94,26187819,"MaxQuant Score",92.6330000,0.8860000,,,,0.0049999998882413,2.4270000
EIEVADYESSDEDRHFK,ph,Y,847,true,"Tissue atlas Arabidopsis - ProteomicsDB",114,32188942,"MaxQuant score",78.5050000,0.7746710,,,,0.003839619923383,
EIEVADYESSDEDRHFK,ph,S,849,true,"srk2dei ABA signaling phopshoproteomics",83,23572148,"MASCOT Score",63.0000000,,,,,,0.0008000
EIEVADYESSDEDRHFK,ph,S,849,true,"Brassinosteroid-Regulated Phosphorylation Dynamics",94,26187819,"MaxQuant Score",204.2100000,1.0000000,,,,1.6179392069094E-41,0.9050000
EIEVADYESSDEDRHFK,ph,S,849,true,"TOR Kinase and ABA Receptor",100,29290610,XCorr,3.0186596,0.9837000,,,,0.017430000007153,
EIEVADYESSDEDRHFK,ph,S,849,true,"Phospho cell culture sucrose/TOR",109,30833711,,,1.0000000,,,,,
KEIEVADYESSDEDR,ph,S,849,true,"LAXIC - mannitol vs control",84b,23660473,XCorr,4.6900000,0.9440000,,,,1.4100000125263E-14,
EIEVADYESSDEDR,ph,S,849,true,"atm and atr DNA damage response",88,25561503,"MASCOT Score",77.0000000,0.9980000,,,,,-0.1600000
EIEVADYESSDEDR,ph,S,849,true,"Tissue atlas Arabidopsis - ProteomicsDB",114,32188942,"MaxQuant score",244.5600000,0.9999970,,,,0,
EIEVADYESSDEDRHFK,ph,S,850,true,"srk2dei ABA signaling phopshoproteomics",83,23572148,"MASCOT Score",63.0000000,,,,,,0.0008000
EIEVADYESSDEDRHFK,ph,S,850,true,"Brassinosteroid-Regulated Phosphorylation Dynamics",94,26187819,"MaxQuant Score",204.2100000,1.0000000,,,,1.6179392069094E-41,0.9050000
EIEVADYESSDEDRHFK,ph,S,850,true,"TOR Kinase and ABA Receptor",100,29290610,XCorr,3.0186596,0.9996000,,,,0.017430000007153,
EIEVADYESSDEDR,ph,S,850,true,"atm and atr DNA damage response",88,25561503,"MASCOT Score",77.0000000,1.0000000,,,,,-0.1600000
EIEVADYESSDEDR,ph,S,850,true,"Tissue atlas Arabidopsis - ProteomicsDB",114,32188942,"MaxQuant score",244.5600000,1.0000000,,,,0,
YARSPPVVVSDVSEDK,ph,Y,863,true,"srk2dei ABA signaling phopshoproteomics",83,23572148,"MASCOT Score",52.0000000,,,,,,0.0003000
YARSPPVVVSDVSEDKLR,ph,S,866,true,"Arabidopsis root NAA phosphoproteome",18a,27643528,"MaxQuant Score",74.7320000,0.8520000,,,,6.5300000073876E-8,-0.0810000
YARSPPVVVSDVSEDKLR,ph,S,866,true,"MAPK Arabidopsis substrates",45,23172892,"MaxQuant Score",171.9800000,,,,,,
YARSPPVVVSDVSEDKLR,ph,S,866,true,"atm and atr DNA damage response",88,25561503,"MASCOT Score",46.0000000,0.9360000,,,,,0.0900000
YARSPPVVVSDVSEDK,ph,S,866,true,"srk2dei ABA signaling phopshoproteomics",83,23572148,"MASCOT Score",42.0000000,,,,,,0.0001000
YARSPPVVVSDVSEDK,ph,S,866,true,"atm and atr DNA damage response",88,25561503,"MASCOT Score",72.0000000,0.9610000,,,,,0.0200000
SPPVVVSDVSEDKLR,ph,S,866,true,"STN8 phosphoproteome",38,21768351,"MASCOT Score",49.1400000,,,,,,2.5105100
SPPVVVSDVSEDKLR,ph,S,866,true,"Chloroplast kinase substrates",60,19376835,"MASCOT Score",81.0300000,,,,,,0.4529790
SPPVVVSDVSEDKLR,ph,S,866,true,"SnRK2 protein kinase substrates",85,23776212,XCorr,2.4474378,0.9990000,,,,0.020373800769448,
SPPVVVSDVSEDKLR,ph,S,866,true,"atm and atr DNA damage response",88,25561503,"MASCOT Score",49.0000000,1.0000000,,,,,0.0900000
SPPVVVSDVSEDKLR,ph,S,866,true,"Phospho cell culture sucrose/TOR",109,30833711,,,1.0000000,,,,,
SPPVVVSDVSEDKLR,ph,S,866,true,"Col-0 callus - FC Col-0 vs. Col-0 Xray",111a,31410901,,57.2600000,,0.8207012,0.0000000,NO,,1.7030275
SPPVVVSDVSEDKLR,ph,S,866,true,"Col-0 X-ray callus - FC Col-0 vs. Col-0 Xray",111b,31410901,,57.2600000,,0.8207012,0.0000000,NO,,1.7030275
SPPVVVSDVSEDKLR,ph,S,866,true,"atm callus - FC atm vs. atm Xray",111c,31410901,,57.2600000,,0.4550456,0.0000000,NO,,1.7030275
SPPVVVSDVSEDKLR,ph,S,866,true,"atm-3 X-ray callus - FC atm vs. atm Xray",111d,31410901,,57.2600000,,0.4550456,0.0000000,NO,,1.7030275
SPPVVVSDVSEDKLR,ph,S,866,true,"Tissue atlas Arabidopsis - ProteomicsDB",114,32188942,"MaxQuant score",176.4300000,1.0000000,,,,2.6941299434222E-18,
SPPVVVSDVSEDKLR,ph,S,866,true,"Touch-induced phosphorylation: 40s touch vs untouc",136,30291188,"MASCOT score",99.2000000,,-0.1813549,0.4459486,NO,,2.4733552
SPPVVVSDVSEDK,ph,S,866,true,"STN8 phosphoproteome",38,21768351,"MASCOT Score",86.9000000,,,,,,-0.9045810
SPPVVVSDVSEDK,ph,S,866,true,"Large-scale phosphorylation discovery",44,23111157,XCorr,2.9140000,,,,,,
SPPVVVSDVSEDK,ph,S,866,true,"Tyrosine phosphorylation in Arabidopsis",59,18463617,"MASCOT Score",67.0000000,,,,,,-0.6960674
SPPVVVSDVSEDK,ph,S,866,true,"Chloroplast kinase substrates",60,19376835,"MASCOT Score",82.1200000,,,,,,-0.2929000
SPPVVVSDVSEDK,ph,S,866,true,"srk2dei ABA signaling phopshoproteomics",83,23572148,"MASCOT Score",75.0000000,,,,,,0.0000000
SPPVVVSDVSEDK,ph,S,866,true,"LAXIC - mannitol vs control",84b,23660473,XCorr,4.0700000,1.0000000,,,,0.00041881398647092,
SPPVVVSDVSEDK,ph,S,866,true,"SnRK2 protein kinase substrates",85,23776212,XCorr,2.9164007,1.0000000,,,,0.0062581999227405,
SPPVVVSDVSEDK,ph,S,866,true,"atm and atr DNA damage response",88,25561503,"MASCOT Score",65.0000000,1.0000000,,,,,-0.5200000
SPPVVVSDVSEDKLR,ph,S,872,true,"Tissue atlas Arabidopsis - ProteomicsDB",114,32188942,"MaxQuant score",63.1850000,1.0000000,,,,0.0019090999849141,
SPPVVVSDVSEDKLR,ph,S,875,true,"Tissue atlas Arabidopsis - ProteomicsDB",114,32188942,"MaxQuant score",80.7260000,1.0000000,,,,0.00018779399397317,
