Peptide,PTM,ModifiedAA,ModifiedPosition,PeptideUniqueToGene,ExperimentDesc,ExpID,PubmedID,ScoreType,IdentScore,LocProb,Log2FChange,PQ-val,QuantSig,PEP,MassErrorPPM
MNPEYDYLFK,nta,M,1,false,"Arabidopsis translation initiation landscape - NTA",167a,35069635,,,,,,,,
SCLLLR,sno,C,23,false,"hot5-4 / wildtype, FAT-switch S-nitrosoproteome",169,37277371,,,,,,,,
SCLLLR,so,C,23,false,"S-sulfenylation site detection using YAP1C",110,32714340,,,,,,,,
TVEQDGKTIK,ub,K,55,false,"Ubiquitination Membrane Proteins",120,33585938,,,,,,,,
IKLQIWDTAGQER,ub,K,58,false,"upl3 mutant / wildtype",168,35926874,"MaxQuant score",66.9890000,1.0000000,0.1335635,,,0.00041832000715658,-0.2893100
TITSSYYR,ph,T,74,false,"atm and atr DNA damage response",88,25561503,"MASCOT Score",29.0000000,0.9990000,,,,,0.5500000
LLVGNKNDLTSQK,ac,K,122,true,"Quantitative Acetylproteomics",101,29440448,,,,,,,,
MASQPAGGAKPPTVQIR,ph,S,175,true,"Tissue atlas Arabidopsis - ProteomicsDB",114,32188942,"MaxQuant score",62.6580000,0.9999980,,,,0.0013345499755815,
MASQPAGGAKPPTVQIR,ac,K,182,true,"Quantitative Acetylproteomics",101,29440448,,,,,,,,
MASQPAGGAKPPTVQIR,ph,T,185,true,"Tissue atlas Arabidopsis - ProteomicsDB",114,32188942,"MaxQuant score",157.5400000,1.0000000,,,,1.6733799735081E-15,
