Peptide,PTM,ModifiedAA,ModifiedPosition,PeptideUniqueToGene,ExperimentDesc,ExpID,PubmedID,ScoreType,IdentScore,LocProb,Log2FChange,PQ-val,QuantSig,PEP,MassErrorPPM
ELLQNSAPELTNR,ph,S,33,true,"Tissue atlas Arabidopsis - ProteomicsDB",114,32188942,"MaxQuant score",275.2300000,1.0000000,,,,0,
SETSSFNLQTPR,ph,T,43,true,"Tissue atlas Arabidopsis - ProteomicsDB",114,32188942,"MaxQuant score",96.2470000,0.9576120,,,,1.5417099819004E-9,
SETSSFNLQTPR,ph,S,45,true,"Large-scale phosphorylation discovery",44,23111157,XCorr,3.1390000,,,,,,
SETSSFNLQTPR,ph,S,45,true,"atm and atr DNA damage response",88,25561503,"MASCOT Score",62.0000000,0.9960000,,,,,-0.0600000
SETSSFNLQTPR,ph,S,45,true,"Tissue atlas Arabidopsis - ProteomicsDB",114,32188942,"MaxQuant score",220.3400000,0.9977060,,,,2.1780522160847E-40,
SETSSFNLQTPR,ph,T,50,true,"atm and atr DNA damage response",88,25561503,"MASCOT Score",49.0000000,1.0000000,,,,,1.7500000
SETSSFNLQTPR,ph,T,50,true,"Tissue atlas Arabidopsis - ProteomicsDB",114,32188942,"MaxQuant score",234.8300000,1.0000000,,,,0,
SIKDLYTER,ph,S,59,true,"Tissue atlas Arabidopsis - ProteomicsDB",114,32188942,"MaxQuant score",125.2400000,1.0000000,,,,0.00037986499955878,
QVAKPEKQSLR,ph,S,402,true,"Tissue atlas Arabidopsis - ProteomicsDB",114,32188942,"MaxQuant score",50.8060000,1.0000000,,,,0.0091401496902108,
